program: Gaussian 09
title: 000080672
version: EM64L-G09RevD.01
frameworkgroup: C1[X(C8H19NO2)]
method: RPBEPBE
basis: SDD
operation: Freq
keyword: #p
keyword: freq=noraman
keyword: PBEPBE/SDD
title: #p freq=noraman PBEPBE/SDD
converged: YES YES NO NO
title: Mulliken charges:
elementType: O O N C C C C C C C C H H H H H H H H H H H H H H H H H H H
charge: -0.275752 -0.278322 -0.571477 -0.431266 0.050657 -0.345630 -0.377557 -0.202534 -0.218383 -0.683613 -0.674474 0.191980 0.208983 0.169956 0.232688 0.213496 0.197687 0.171777 0.176144 0.225744 0.182615 0.193177 0.260368 0.268002 0.202174 0.231124 0.223386 0.201803 0.233526 0.223719
chargesum: 0.00000
title: Mulliken charges with hydrogens summed into heavy atoms:
elementType: O O N C C C C C C C C
charge: -0.275752 -0.278322 -0.043107 -0.030302 0.220613 0.100555 -0.008093 0.199354 0.157409 -0.026929 -0.015426
polarizability: 1.12425029e+02 1.67874642e+00 1.09303931e+02 6.28279520e-01 1.95821482e+00 8.98791500e+01
1716.lowfreq: -11.5801 -9.7556 -5.1770 -0.0006 0.0003 0.0004 25.6837 42.2233 43.6271
frequency: 25.4959 42.0403 43.5645 60.4134 64.5386 77.7636 121.0793 149.5744 194.8869 201.4408 235.7839 243.3391 248.0945 266.1941 323.6035 327.3094 418.0941 455.4229 534.6224 604.1192 643.5280 752.2910 801.2318 810.7097 813.4134 845.6980 872.2536 913.3125 943.9392 977.8951 1028.1302 1042.7620 1062.5411 1079.0119 1100.9697 1110.4920 1115.1109 1126.0459 1136.2538 1138.3748 1158.2706 1210.9625 1244.4562 1250.2204 1271.7754 1278.4443 1289.5312 1315.6778 1325.2542 1357.4414 1373.9526 1382.1388 1389.2540 1393.7122 1397.4351 1454.1371 1458.5611 1459.3842 1474.2260 1478.5078 1480.8635 1492.0548 1493.4926 1495.4985 1636.2835 2843.7923 2853.8293 2916.7142 2933.6763 2967.9819 2978.9993 2991.1918 2992.4328 2993.1312 3003.8467 3027.5633 3033.4071 3073.4463 3089.8927 3090.4715 3100.1237 3100.7055 3447.7049 3575.7503
redmass: 2.6264 1.9245 2.2476 3.3174 1.6796 2.6741 2.7440 2.9286 2.3762 2.3924 1.2421 1.3909 1.1982 3.4159 3.2900 3.0000 3.2183 2.9321 4.1549 1.2728 4.2599 1.2663 1.7570 1.1194 1.1204 2.5481 1.5789 2.8144 2.5427 2.1555 3.0266 3.4163 2.9666 2.3279 2.3490 2.0384 2.2360 2.2151 1.4426 1.5260 1.6830 1.3973 1.1611 1.1480 1.2686 1.0750 1.3430 1.2645 1.2022 1.4977 1.3487 1.2599 1.4714 1.2853 1.3284 1.0799 1.0412 1.0414 1.0751 1.0510 1.0476 1.0790 1.0826 1.0905 1.0938 1.0823 1.0715 1.0571 1.0657 1.1032 1.0614 1.0801 1.0358 1.0359 1.0680 1.0988 1.0957 1.1022 1.0988 1.0991 1.1012 1.1009 1.0446 1.0974
irintensity: 2.0224 0.5531 0.1835 0.3288 4.7862 4.1067 1.1004 8.2932 1.0205 2.4428 3.3439 5.4823 43.5520 7.3463 6.2614 3.1724 23.7889 3.5784 0.8824 215.3091 2.1628 0.7711 36.2341 4.5113 4.7390 9.6382 2.4242 42.2780 124.7284 18.4265 21.7668 139.9711 44.7600 14.5526 13.7099 9.4933 12.5121 60.4547 7.6172 6.4935 38.2975 15.4035 3.1732 1.7188 11.7231 2.4088 27.7270 36.4043 34.9822 2.3906 3.9368 13.7769 16.8124 17.8531 14.5275 6.8905 12.1879 11.0564 5.2551 5.7533 8.1145 5.1694 4.4599 6.1443 41.3508 78.1162 127.8522 66.1204 75.4287 59.7646 39.5556 13.5864 30.1820 22.3956 58.2400 16.2062 23.2145 51.0906 37.5382 37.4157 41.3922 38.1033 2.4539 0.1560
temp: 298.150 k
press: 1.00000 atm
elementType: 8 8 7 6 6 6 6 6 6 6 6 1 1 1 1 1 1 1 1 1 1 1 1 1 1 1 1 1 1 1
symmnumber: 1
zpe: 696989.5 jmol-1
zpe.correction: 0.265469 hartree
zpe.thermalcorrener: 0.280596 hartree
zpe.thermalcorrenthalpy: 0.281540 hartree
zpe.thermalcorrgfe: 0.221072 hartree
zpe.sumelectzpe: -520.470870 hartree
zpe.sumelectthermal: -520.455744 hartree
zpe.sumelectthermalent: -520.454800 hartree
zpe.sumelectthermalfe: -520.515267 hartree
dipole: -0.8614 0.2969 2.0849
dipole: 2.2753
quadrupole: -60.4271 -65.3788 -70.5418
quadrupole: -3.5229 1.3362 3.8781
quadrupole: 5.0221 0.0704 -5.0926 -3.5229 1.3362 3.8781
hfenergy: -520.7363395 hartree
pointgroup: C01 [X(C8H19N1O2)]
dipole: -0.3124046 0.1987932 0.8149889 debye
polarizability: 113.0113697|0.5627475|108.630153|1.6540929|1.8602491|89.9665868 unknown
InChI: InChI=1S/C8H19NO2/c1-3-10-8(11-4-2)6-5-7-9/h8H,3-7,9H2,1-2H3
charge 0 multiplicity 1
30 atoms
O  -1.154874 -1.04469 0.178936
O  -0.618141 1.208131 -0.255744
N  3.982357 -1.457939 -0.861379
C  0.90466 -0.235126 1.117073
C  -0.541996 0.123703 0.748176
C  1.759628 -0.67204 -0.090815
C  3.193105 -1.057256 0.322637
C  -2.596297 -0.883518 -0.111075
C  -0.528161 2.557802 0.321712
C  -3.094262 -2.214128 -0.672005
C  -0.795016 3.556488 -0.805156
H  1.366381 0.645604 1.608283
H  0.868049 -1.043453 1.874371
H  -1.112637 0.462874 1.652429
H  1.803834 0.140466 -0.83783
H  1.266122 -1.533164 -0.582271
H  3.689442 -0.179201 0.782514
H  3.135955 -1.845493 1.116297
H  -3.1284 -0.617279 0.829996
H  -2.728006 -0.05756 -0.834715
H  -1.276204 2.668791 1.139753
H  0.480939 2.723682 0.757657
H  3.551684 -2.218958 -1.397469
H  4.972451 -1.640924 -0.669771
H  -4.173544 -2.153977 -0.903747
H  -2.551033 -2.466041 -1.599077
H  -2.935457 -3.029772 0.054656
H  -0.729174 4.593521 -0.427882
H  -0.054512 3.428849 -1.613322
H  -1.800693 3.399408 -1.232133
