program: Gaussian 09
title: 000080666
version: EM64L-G09RevD.01
frameworkgroup: C1[X(C6H14N4S2)]
method: RPBEPBE
basis: SDD
operation: Freq
keyword: #p
keyword: freq=noraman
keyword: PBEPBE/SDD
title: #p freq=noraman PBEPBE/SDD
converged: YES YES NO NO
title: Mulliken charges:
elementType: S S N N N N C C C C C C H H H H H H H H H H H H H H
charge: 0.132675 0.133253 -0.590640 -0.607000 -0.304208 -0.311674 -0.339952 -0.332578 -0.691292 -0.647416 -0.094656 -0.078115 0.220518 0.216010 0.211353 0.207089 0.255592 0.276604 0.273640 0.289880 0.330891 0.326322 0.318391 0.327669 0.254067 0.223575
chargesum: 0.00000
title: Mulliken charges with hydrogens summed into heavy atoms:
elementType: S S N N N N C C C C C C
charge: 0.132675 0.133253 0.066574 0.039060 -0.050140 -0.088099 0.096576 0.085864 -0.159096 -0.083896 -0.094656 -0.078115
polarizability: 2.01041351e+02 -2.23042777e+00 1.31676477e+02 -2.65472138e+00 -7.19523555e-01 7.03217109e+01
1716.lowfreq: -21.3250 -8.7182 -0.6289 -0.0033 -0.0028 -0.0027 4.9491 22.5491 28.3015
frequency: -20.8051 22.4462 28.2557 40.0107 46.6116 59.9443 97.8023 108.3891 129.7688 164.8724 193.0953 324.2600 330.9792 338.6098 359.3949 392.2314 393.9578 410.4100 442.4938 466.4113 470.5882 559.6466 573.3135 596.0686 596.4068 706.5560 717.7030 720.6064 734.0592 744.9768 778.2033 885.3721 989.3000 1029.2949 1030.5549 1033.4918 1037.4747 1044.6342 1074.6829 1080.4224 1091.7997 1217.2991 1223.1109 1246.2968 1262.4622 1281.8163 1282.4123 1295.4752 1317.3137 1352.6415 1446.1975 1453.0083 1471.8964 1485.0519 1591.7845 1612.9219 1638.6672 1668.3469 2978.2675 2989.5501 3003.3352 3025.5704 3042.4372 3051.2170 3085.3814 3118.8981 3358.1361 3453.9232 3527.7072 3543.9974 3676.2889 3699.5178
redmass: 3.6243 4.0030 4.5975 4.3151 3.3352 4.6275 4.8008 2.1624 2.4813 8.6790 4.9043 3.8307 1.0686 3.7267 1.2012 3.8554 1.3113 4.1669 3.0612 5.9498 1.4425 3.2973 3.6641 4.0486 3.1343 5.9303 1.3377 3.6981 1.3738 1.0840 1.1433 1.2696 1.8213 1.6360 3.3607 1.4159 1.8196 1.8605 2.5412 2.0564 1.0645 1.2005 1.3789 1.5152 2.0930 1.3768 1.9117 1.0643 1.3582 1.4958 1.0840 1.0844 1.0738 1.0981 1.2076 1.4366 2.9159 5.1964 1.0593 1.0592 1.0565 1.1008 1.0578 1.1041 1.1086 1.1082 1.0768 1.0782 1.0448 1.0447 1.1043 1.1046
irintensity: 0.4956 1.9828 5.5786 1.0431 2.6339 11.7072 1.0210 2.1513 0.1507 0.1643 10.6336 3.1623 12.8866 4.7912 69.0427 16.5657 295.5516 4.3494 60.7959 4.7456 186.3379 16.4552 54.6406 80.5181 75.6760 5.4339 59.8720 5.6945 69.2188 27.9474 0.3523 1.6820 164.1532 102.6055 0.9058 18.9637 82.3994 0.1031 4.4462 5.5500 2.3049 13.0516 0.2530 80.4927 339.9442 45.5540 100.5912 0.1087 2.5509 0.2148 9.1352 3.5387 0.0791 10.7440 85.4612 108.3931 248.8694 270.1143 6.8216 15.4195 28.0234 2.4925 9.4661 21.4975 34.8035 17.6471 23.9908 8.6237 33.7139 55.5033 21.2762 34.8167
temp: 298.150 k
press: 1.00000 atm
elementType: 16 16 7 7 7 7 6 6 6 6 6 6 1 1 1 1 1 1 1 1 1 1 1 1 1 1
symmnumber: 1
zpe: 545772.5 jmol-1
zpe.correction: 0.207874 hartree
zpe.thermalcorrener: 0.223285 hartree
zpe.thermalcorrenthalpy: 0.224229 hartree
zpe.thermalcorrgfe: 0.161982 hartree
zpe.sumelectzpe: -1251.184070 hartree
zpe.sumelectthermal: -1251.168659 hartree
zpe.sumelectthermalent: -1251.167714 hartree
zpe.sumelectthermalfe: -1251.229962 hartree
dipole: -3.3774 0.4896 -0.5786
dipole: 3.4614
quadrupole: -54.5907 -90.6702 -92.2219
quadrupole: 12.2425 -2.1301 -2.7857
quadrupole: 24.5703 -11.5093 -13.0610 12.2425 -2.1301 -2.7857
hfenergy: -1251.3919436 hartree
pointgroup: C01 [X(C6H14N4S2)]
dipole: -1.3403875 0.1280775 -0.2037346 debye
dipolederiv: -0.7827534 0.1952028 0.1033654 0.4226659 -0.3378855 -0.0288876 0.1818223 -0.0379131 -0.1394452 -0.700453 0.1125005 -0.034996 0.23973 -0.2495439 0.0184676 -0.0423659 0.02136 -0.151401 -1.1386472 -0.5076795 0.107622 -0.3056404 -0.5671924 -0.0115975 0.1126268 0.01252 -0.733598 -1.2167822 -0.4606002 0.0191326 -0.259815 -0.5199644 -0.0370637 -0.0112111 -0.0462507 -0.697124 -0.6540913 0.2178947 -0.0391941 0.1857888 -1.2874053 0.0304828 -0.0308685 -0.0347226 -0.4534535 -0.3107802 -0.2083462 0.0250374 0.2325022 -1.2589683 0.07048 0.0001512 0.0458815 -0.4584201 -0.0754819 0.0037105 0.0076136 -0.0895063 0.0813054 0.0091483 -0.0067474 0.0027027 0.1620027 -0.1363196 0.0108234 0.006734 -0.0807538 0.0778031 -0.0205503 -0.0019424 -0.0142709 0.1747421 0.3656698 0.1134797 0.0098641 0.1812726 0.0667471 -0.0450974 -0.0159538 -0.0271554 0.153232 0.4617391 0.1139122 0.0136075 0.1698339 0.0712163 0.0357229 0.0030195 0.0295735 0.1383106 1.6228118 0.0358489 -0.3607433 -0.2566326 1.4357651 -0.0594859 -0.4627579 -0.065388 0.2248064 1.5437125 0.1925099 0.0642816 -0.3530436 1.409387 -0.1146871 0.1246572 -0.0982495 0.0867567 0.0689702 0.0061932 -0.0193297 0.0254738 -0.0196979 0.1003236 -0.0197063 0.100392 -0.0405525 0.0789598 -0.0031178 0.0103725 0.0179458 0.0039652 -0.0964185 0.0153079 -0.0975158 -0.0717073 0.0715861 0.0051922 0.0192079 0.0202222 -0.0026776 -0.0982167 0.028207 -0.101198 -0.0762948 0.0661784 0.0086909 -0.0208542 0.0287798 -0.0285589 0.1059405 -0.0294222 0.1098586 -0.0524058 -0.0169451 -0.0180489 -0.0100786 -0.0525091 -0.0634562 0.1060806 -0.0393898 0.0839655 -0.0217192 -0.0141094 -0.0233539 0.0074388 -0.0665692 -0.0170495 -0.0852375 0.0199298 -0.0725761 -0.0468043 -0.021498 -0.0322892 -0.0106427 -0.0599101 -0.0094142 -0.0876014 0.0175669 -0.0734552 -0.0363515 0.0207039 -0.0341077 0.0022047 -0.0663056 -0.0026132 0.0680969 -0.0219552 0.0570154 -0.0048768 0.1955893 0.0340497 0.0484898 0.0241461 0.1647172 0.0314896 0.0856884 0.0296274 0.3730212 0.2525861 0.0811588 0.0301363 0.0838758 0.1982785 0.0333029 0.0242568 0.0586506 0.366218 0.1366467 0.0352394 -0.0184282 0.0261371 0.1372373 0.0242119 -0.0204035 0.0242962 0.3912603 0.2470331 0.0339956 -0.0150007 0.0282683 0.1354711 0.0250848 -0.0134122 0.0270438 0.4114465 0.1039033 -0.1454539 0.0981433 -0.1679391 0.3349695 0.0176214 0.137163 0.046757 0.2183985 -0.1682289 0.2325951 -0.0439839 0.0719824 0.2475646 0.0083898 -0.0342608 0.0190515 0.2839589 unknown
polarizability: 200.9415652|0.7137494|131.532294|-5.2970439|-2.4118649|70.5656794 unknown
InChI: InChI=1S/C6H14N4S2/c7-5(8)11-3-1-2-4-12-6(9)10/h7,9H,1-4,8,10H2
charge 0 multiplicity 1
26 atoms
S  3.306217 1.052484 0.149053
S  -3.367836 -1.068013 0.131898
N  5.876239 0.682778 -0.581345
N  -6.013977 -0.64593 -0.058616
N  4.832035 -1.377803 -0.180847
N  -4.62202 1.356338 -0.132373
C  0.554196 0.493467 0.138843
C  -0.620436 -0.51718 0.099069
C  1.912517 -0.225112 0.059932
C  -1.972873 0.210587 0.16667
C  4.775438 -0.078402 -0.230796
C  -4.817922 0.069784 -0.04247
H  0.462548 1.205535 -0.703851
H  0.49984 1.087961 1.071851
H  -0.565368 -1.116679 -0.830938
H  -0.52788 -1.224781 0.947137
H  2.031509 -0.925198 0.906382
H  2.021585 -0.774587 -0.891215
H  -2.090295 0.796244 1.092393
H  -2.141359 0.882447 -0.689408
H  6.756939 0.195996 -0.738246
H  5.79038 1.668987 -0.811049
H  -6.900926 -0.156276 -0.157465
H  -6.026495 -1.660493 0.030531
H  3.995377 -1.862129 0.178069
H  -5.482535 1.928374 -0.22901
