program: Gaussian 09
title: 000080685
version: EM64L-G09RevD.01
frameworkgroup: C1[X(C14H14N4O4)]
method: RPBEPBE
basis: SDD
operation: Freq
keyword: #p
keyword: freq=noraman
keyword: PBEPBE/SDD
title: #p freq=noraman PBEPBE/SDD
converged: YES YES NO NO
title: Mulliken charges:
elementType: O O O O N N N N C C C C C C C C C C C C C C H H H H H H H H H H H H H H
charge: -0.261623 -0.300058 -0.224768 -0.224842 -0.080915 -0.664079 -0.151960 0.018264 -0.011537 0.278498 0.396577 0.206275 -0.384151 -0.549062 0.185923 0.378930 -0.332390 -0.271326 -0.344940 -0.344270 -0.501234 -0.526406 0.296859 0.256682 0.252505 0.262031 0.351179 0.318371 0.284377 0.281522 0.237457 0.236993 0.222860 0.232817 0.242658 0.232784
chargesum: 0.00000
title: Mulliken charges with hydrogens summed into heavy atoms:
elementType: O O O O N N N N C C C C C C C C C C C C C C
charge: -0.261623 -0.300058 -0.224768 -0.224842 -0.080915 0.005470 -0.151960 0.018264 -0.011537 0.278498 0.396577 0.206275 -0.087292 -0.292380 0.185923 0.378930 -0.079885 -0.009295 -0.060563 -0.062748 0.196076 0.181852
polarizability: 6.25091564e+02 1.53538126e+01 2.26273686e+02 -5.97660490e-02 -2.23284242e-01 8.38043381e+01
1716.lowfreq: -6.3064 -2.9210 -0.0006 -0.0004 0.0004 3.6129 18.9939 31.5708 44.9117
frequency: 18.9259 31.5648 44.9105 49.7760 72.6411 88.7240 101.9631 128.1415 143.9948 175.4875 182.4300 205.4235 209.5324 228.0113 247.1579 249.8846 280.7519 285.5060 331.2667 336.3782 352.2922 408.3302 413.4323 416.9987 459.9606 480.8639 484.3571 488.0331 520.7446 522.9613 549.7335 559.3645 600.8800 622.8831 659.5855 664.2398 688.4572 691.2111 730.9723 742.0580 749.5642 777.9000 835.3933 841.4397 859.2952 872.7515 897.0244 897.6246 949.2166 990.0946 991.3618 997.1000 998.6026 1055.3124 1092.9173 1099.5602 1114.5803 1118.0760 1128.9409 1144.4886 1145.5399 1164.4433 1186.8080 1195.6610 1214.3993 1243.2847 1249.3746 1280.8686 1300.2090 1321.8345 1348.5312 1396.4170 1409.3108 1432.2687 1435.0760 1443.8881 1447.6548 1452.1770 1462.9778 1463.2541 1467.2612 1475.7073 1525.5962 1559.0964 1575.2671 1600.5701 1611.2924 1645.1147 2971.2881 2994.2024 3063.1301 3102.0473 3122.7138 3131.9872 3159.6448 3162.9525 3164.9022 3168.6890 3185.7799 3188.6831 3545.5839 3694.5359
redmass: 5.5409 5.4373 6.2707 4.0167 6.8903 3.9359 4.2925 5.9668 4.9487 6.5359 3.5467 3.9865 1.4202 3.3393 1.5227 4.6042 4.1008 2.7900 6.6163 3.9970 5.0349 7.7012 2.1626 2.9949 7.7221 1.6226 6.3520 3.2827 5.8336 3.9705 7.3753 1.1147 4.2197 7.1734 7.6290 4.7989 5.5473 8.7296 7.1020 3.1142 3.0599 8.4341 5.0399 1.2455 1.8693 1.6853 5.2305 1.5167 6.7528 2.8075 1.3309 4.5596 1.3460 1.5083 3.2814 1.2858 1.2421 1.2596 2.2828 1.6011 1.5654 1.6670 2.8497 2.9071 5.2740 1.7205 3.1684 1.3885 7.0282 4.5993 8.8620 5.1428 2.4792 4.6553 1.3066 2.5000 1.0536 1.0831 1.0489 1.9398 2.1579 1.2156 4.6681 7.4425 8.0194 6.5917 1.4883 3.4072 1.0322 1.0282 1.1044 1.1044 1.1057 1.1008 1.0892 1.0912 1.0911 1.0877 1.0955 1.0965 1.0449 1.1044
irintensity: 0.0477 0.7123 0.5799 1.4442 0.0101 7.2110 8.9080 0.1654 3.7901 0.0922 3.9775 5.2381 0.1373 0.2727 1.1910 11.9592 2.9575 0.1396 0.4322 3.2174 0.4806 14.9808 60.4473 2.0018 0.0100 51.1030 8.9247 8.9516 6.6806 35.2669 20.3101 148.0119 2.0668 0.4605 9.1393 22.2028 20.9075 4.8881 3.5504 0.7032 0.0193 16.8774 19.0510 0.0150 53.8640 54.2135 5.2544 31.3714 26.8952 3.2949 0.9878 51.2190 0.3093 10.9156 55.8550 26.0060 0.1306 0.0852 4.4342 472.4566 33.0465 77.9019 141.1928 372.8788 1423.3921 146.7426 75.6791 20.0357 486.0505 355.6604 92.4208 68.5247 34.6787 18.6263 11.0560 18.2724 13.7900 52.9792 15.6863 6.9759 14.4747 51.8546 412.9819 105.5907 29.6195 217.4555 17.9075 628.1152 37.9659 28.5824 37.7277 27.6086 41.1365 25.3584 3.4641 3.4167 19.2793 1.2916 1.9909 0.3514 346.4572 45.9308
temp: 298.150 k
press: 1.00000 atm
elementType: 8 8 8 8 7 7 7 7 6 6 6 6 6 6 6 6 6 6 6 6 6 6 1 1 1 1 1 1 1 1 1 1 1 1 1 1
symmnumber: 1
zpe: 703351.0 jmol-1
zpe.correction: 0.267892 hartree
zpe.thermalcorrener: 0.288381 hartree
zpe.thermalcorrenthalpy: 0.289326 hartree
zpe.thermalcorrgfe: 0.217123 hartree
zpe.sumelectzpe: -1060.064496 hartree
zpe.sumelectthermal: -1060.044007 hartree
zpe.sumelectthermalent: -1060.043062 hartree
zpe.sumelectthermalfe: -1060.115265 hartree
dipole: 11.5636 -0.8780 -0.0007
dipole: 11.5969
quadrupole: -149.7796 -108.3455 -130.9357
quadrupole: -7.2765 -0.0746 -0.0002
quadrupole: -20.0927 21.3414 -1.2487 -7.2765 -0.0746 -0.0002
hfenergy: -1060.3323879 hartree
pointgroup: C01 [X(C14H14N4O4)]
dipole: -4.5595195 0.1404916 0.0894376 debye
polarizability: 622.6467817|33.1144378|228.3722835|-11.8512718|-4.2270359|84.1505238 unknown
InChI: InChI=1S/C14H14N4O4/c1-21-13-8-12(14(22-2)7-11(13)15)17-16-9-3-5-10(6-4-9)18(19)20/h3-8H,15H2,1-2H3
charge 0 multiplicity 1
36 atoms
O  -2.321878 -3.108791 -0.061683
O  -4.868776 1.895317 -0.146417
O  6.333181 1.577191 -0.361384
O  6.355137 -0.706866 -0.314935
N  -0.603764 -0.66806 -0.163455
N  -6.240417 -0.371025 -0.06052
N  0.030308 0.499183 -0.20522
N  5.73228 0.429727 -0.324911
C  -1.997843 -0.585294 -0.137049
C  -2.779974 -1.79935 -0.089268
C  -4.867476 -0.48694 -0.083862
C  -4.081959 0.73024 -0.130972
C  -2.699368 0.673845 -0.156261
C  -4.193132 -1.723887 -0.064074
C  1.445207 0.38484 -0.232699
C  4.260356 0.416066 -0.293111
C  2.155786 1.620738 -0.273339
C  2.181066 -0.842028 -0.223031
C  3.558162 1.64505 -0.303519
C  3.581567 -0.82806 -0.253179
C  -0.89779 -3.480502 -0.07861
C  -4.1575 3.176241 -0.194473
H  -2.070121 1.567562 -0.192177
H  -4.75038 -2.664635 -0.027971
H  1.573638 2.547376 -0.280201
H  1.629953 -1.785169 -0.191937
H  -6.651976 0.560169 -0.077683
H  -6.840656 -1.190119 -0.027643
H  4.120512 2.581629 -0.334795
H  4.168748 -1.750382 -0.246776
H  -0.370765 -3.062668 0.795185
H  -0.407078 -3.119203 -0.997572
H  -0.914267 -4.58122 -0.043789
H  -3.511582 3.300174 0.695199
H  -4.941512 3.947097 -0.201484
H  -3.544291 3.250553 -1.112384
