program: Gaussian 09
title: 000080654
version: EM64L-G09RevD.01
frameworkgroup: C1[X(C8H9NO)]
method: RPBEPBE
basis: SDD
operation: Freq
keyword: #pfreq=noraman
keyword: PBEPBE/SDD
title: #p freq=noraman PBEPBE/SDD
converged: YES YES NO NO
title: Mulliken charges:
elementType: O N C C C C C C C C H H H H H H H H H
charge: -0.266246 -0.304253 0.476755 -0.529667 -0.365124 -0.436526 -0.218749 -0.215101 -0.240204 -0.043209 0.269727 0.229696 0.248455 0.231584 0.228509 0.227897 0.305711 0.230774 0.169970
chargesum: 0.00000
title: Mulliken charges with hydrogens summed into heavy atoms:
elementType: O N C C C C C C C C
charge: -0.266246 0.001459 0.476755 -0.030244 -0.116669 -0.204943 0.009760 0.012796 -0.009430 0.126761
polarizability: 1.28134770e+02 -5.96380160e+00 9.08966573e+01 5.40090795e+00 4.05785931e-01 5.58949007e+01
1716.lowfreq: -14.9650 -8.0030 -0.0009 -0.0008 -0.0003 7.3832 22.1241 35.8834 123.9240
frequency: 21.6982 35.7161 123.9199 210.9977 264.1361 316.1194 386.2829 403.5112 477.2736 580.9259 609.9345 616.0744 704.7746 717.4848 759.0466 820.7728 856.2726 917.5824 943.8883 964.0937 979.0723 990.0129 996.9907 1015.1258 1026.1219 1087.0870 1173.0620 1183.6152 1188.9912 1213.2653 1227.4122 1317.7066 1347.9587 1364.7721 1385.9989 1441.2188 1469.7464 1475.5902 1486.5376 1595.3354 1614.3929 1637.6829 2936.3703 2989.1775 3048.3751 3116.3190 3124.5242 3136.3138 3147.5274 3164.5811 3540.4687
redmass: 5.8170 4.2836 3.3723 6.2804 3.0388 3.0448 2.6581 2.8069 3.5436 2.5728 1.4081 6.3314 2.0117 3.3333 1.8527 3.7099 1.2473 1.3853 3.0644 1.6045 1.3925 6.0945 1.3408 2.3070 2.1934 1.5551 1.0544 1.8797 1.2030 2.2840 1.3070 1.3352 1.3648 1.2377 5.8286 2.1405 1.4528 1.4682 1.8084 6.0619 6.0327 5.7641 1.0866 1.0614 1.1003 1.0873 1.0862 1.0913 1.0962 1.1015 1.0784
irintensity: 7.0853 3.9354 7.6720 13.0321 13.6781 21.4101 12.0601 0.4433 15.1962 13.5455 115.5042 0.6571 40.9151 13.8147 49.1278 8.4106 0.1797 2.2766 11.3007 3.1763 0.0321 0.1582 0.4506 3.4328 7.3426 16.2012 0.1361 34.5727 4.6482 2.1271 46.5488 4.8708 8.0904 14.1704 2.0917 21.6089 114.1182 30.2444 16.1854 0.4594 10.1752 284.1418 121.8681 30.6798 10.6752 8.9829 0.8388 11.7825 38.8907 20.3223 16.1952
temp: 298.150 k
press: 1.00000 atm
elementType: 8 7 6 6 6 6 6 6 6 6 1 1 1 1 1 1 1 1 1
symmnumber: 1
zpe: 401657.3 jmol-1
zpe.correction: 0.152983 hartree
zpe.thermalcorrener: 0.161969 hartree
zpe.thermalcorrenthalpy: 0.162913 hartree
zpe.thermalcorrgfe: 0.116898 hartree
zpe.sumelectzpe: -439.502553 hartree
zpe.sumelectthermal: -439.493567 hartree
zpe.sumelectthermalent: -439.492623 hartree
zpe.sumelectthermalfe: -439.538638 hartree
dipole: 2.6835 -1.3528 2.9773
dipole: 4.2303
quadrupole: -66.2904 -53.5685 -59.8746
quadrupole: 3.5438 -9.1238 1.2809
quadrupole: -6.3792 6.3427 0.0365 3.5438 -9.1238 1.2809
hfenergy: -439.6555362 hartree
pointgroup: C01 [X(C8H9N1O1)]
dipole: -0.9744389 -0.6600131 -1.1768075 debye
dipolederiv: -0.7506255 -0.1389216 -0.0961714 -0.2892596 -0.4871263 -0.1383913 -0.5118151 -0.2785213 -0.8078507 -1.2305039 -0.192062 -0.1829221 -0.198329 -0.5879722 -0.0637159 -0.0558966 0.0187742 -0.2709166 0.2257366 -0.049087 0.0789223 -0.0700678 -0.0499328 0.0149245 0.1314282 0.028791 -0.0441434 0.392153 -0.0241914 -0.0942832 -0.120001 0.3137467 -0.0869216 -0.3891258 -0.1161376 0.1882988 -0.073602 0.0899397 0.0007109 0.1342462 -0.0290483 -0.0029483 -0.0178214 0.0091642 -0.1535146 -0.1626409 -0.0090463 0.0089775 0.0076969 0.0775821 -0.042239 0.0252861 -0.0541096 -0.1590174 -0.0314179 -0.0173642 0.0207146 -0.0274366 0.1254814 -0.0451145 0.0220677 -0.0441539 -0.1374958 0.0550057 0.0857552 0.0244022 0.1017889 0.0205402 -0.0105029 0.0057544 -0.0142476 -0.1408198 0.0424705 -0.0526398 0.0491478 -0.0524605 -0.0637009 -0.0247097 0.0415018 -0.0257552 -0.1580269 1.3000557 0.5438499 0.2403822 0.7496769 0.4883617 0.2983035 0.5005813 0.3256777 0.9517103 0.0751994 0.0185633 -0.0754549 0.0378333 0.0850688 -0.0691703 0.0485648 -0.0127799 0.0252395 -0.0108894 -0.0587669 0.0320738 0.0038702 -0.1559686 0.0634627 0.0798469 0.025932 0.0869029 -0.0115856 -0.0983628 -0.0136806 -0.1001839 0.0314547 0.0055074 -0.0230758 0.0038556 0.1399803 0.0860827 0.0613818 -0.0203847 0.0355024 -0.1050269 0.0446741 -0.0142646 0.0490314 0.1433933 0.0700778 0.0281491 -0.0167061 0.046203 -0.1120266 0.0465929 -0.0150854 0.0459292 0.1464716 -0.0550007 -0.1032409 -0.0156266 -0.1122539 0.0015735 0.0063051 -0.0204913 0.0074842 0.154616 0.2075694 -0.1021215 0.006883 -0.136284 0.2749444 -0.0154223 0.0393072 -0.019492 0.090752 -0.0997123 0.0640093 -0.0516022 0.0673427 0.0660045 0.0259295 -0.054538 0.0267018 0.1509592 -0.0283727 -0.045844 0.1046175 -0.0778841 0.1060446 -0.0065641 0.2077758 0.0238558 -0.2065386 unknown
polarizability: 127.1183829|6.6575356|90.2452468|9.9270009|-4.0172135|57.5626986 unknown
InChI: InChI=1S/C8H9NO/c10-7-9-6-8-4-2-1-3-5-8/h1-5,7,9H,6H2
charge 0 multiplicity 1
19 atoms
O  3.581691 0.52066 0.983537
N  2.098692 -0.598657 -0.447837
C  -0.294185 -0.445863 0.259855
C  1.105585 -0.955991 0.584816
C  -0.516877 0.93303 0.008608
C  -1.395058 -1.33619 0.221234
C  -1.814918 1.40943 -0.274995
C  -2.697365 -0.861172 -0.060676
C  -2.910409 0.513247 -0.3105
C  3.250255 0.110912 -0.164295
H  1.486288 -0.511147 1.523326
H  1.085406 -2.054422 0.721713
H  0.329752 1.629205 0.041225
H  -1.234609 -2.404579 0.414346
H  -1.975485 2.477067 -0.462798
H  -3.540285 -1.560868 -0.086634
H  1.907987 -0.864087 -1.41654
H  -3.918027 0.88364 -0.52977
H  3.867564 0.291585 -1.074017
