program: Gaussian 09
title: 000080770
version: EM64L-G09RevD.01
frameworkgroup: C1[X(C17H12BrNO3)]
method: RPBEPBE
basis: SDD
operation: Freq
keyword: #p
keyword: freq=noraman
keyword: PBEPBE/SDD
title: #p freq=noraman PBEPBE/SDD
converged: YES YES NO NO
title: Mulliken charges:
elementType: Br O O O N C C C C C C C C C C C C C C C C C H H H H H H H H H H H H
charge: 0.081051 -0.196440 -0.173368 -0.252876 -0.205574 0.078849 0.367774 0.338450 0.262206 0.254037 -0.129465 -0.179968 -0.432454 -0.352764 -0.188676 -0.373264 -0.365564 -0.637089 -0.225004 -0.226037 0.197664 -0.759666 0.268399 0.264268 0.290991 0.292123 0.218138 0.264086 0.281314 0.242719 0.242816 0.236002 0.249958 0.267360
chargesum: 0.00000
title: Mulliken charges with hydrogens summed into heavy atoms:
elementType: Br O O O N C C C C C C C C C C C C C C C C C
charge: 0.081051 -0.196440 -0.173368 -0.252876 -0.205574 0.078849 0.367774 0.338450 0.262206 0.254037 -0.129465 -0.179968 -0.432454 -0.084365 0.075592 -0.082272 -0.073441 0.126449 0.017715 0.016779 0.197664 -0.006346
polarizability: 3.26494460e+02 1.19256586e+01 2.93277742e+02 5.31569512e-01 -1.83674955e+00 1.03691607e+02
1716.lowfreq: -0.0004 -0.0002 0.0007 2.2293 4.8776 6.5770 24.7941 31.5498 48.4363
frequency: 24.7856 31.4360 48.4215 55.7033 83.5360 112.7411 116.5667 121.0910 137.7124 151.1030 174.0820 194.9433 217.2786 227.6764 266.6375 291.6587 323.0166 350.2235 365.7085 374.3205 387.9648 417.7573 422.5289 437.5181 470.9810 477.1921 488.3113 504.4914 577.6917 591.8223 608.2010 628.6454 646.3175 667.9343 697.0110 731.4716 747.2550 753.9423 798.4263 810.9303 840.5548 853.5074 896.8445 907.6855 930.0137 966.3799 972.9751 999.0762 1000.1878 1016.1508 1036.0092 1036.1811 1083.0473 1089.0325 1109.1012 1113.2505 1143.1828 1168.6391 1171.5657 1182.5999 1241.2587 1266.7020 1289.8293 1293.3868 1321.0161 1353.9894 1366.4895 1386.9775 1404.6219 1410.4486 1433.3095 1441.5002 1448.2359 1452.2466 1469.2739 1472.8497 1490.0083 1524.1607 1535.0526 1561.2393 1569.3880 1596.6624 1603.5118 1609.4564 3002.2987 3002.9103 3094.5671 3099.1517 3119.8329 3124.8776 3139.4745 3154.4846 3154.7426 3166.4523 3174.8543 3176.3396
redmass: 7.3773 5.7943 6.1393 7.7657 2.5511 1.4914 3.5217 1.1245 7.1623 5.3702 4.3965 4.0570 8.8524 5.2129 5.7810 4.9998 6.2429 6.1815 5.8874 5.0008 10.5438 3.3585 5.4971 4.1883 7.4150 7.4899 5.0309 4.9669 4.1902 3.4826 5.5348 6.4289 5.8966 4.6844 7.5810 2.8366 3.8083 6.3934 6.1497 1.9381 1.5755 3.3389 5.0712 5.4276 1.6788 2.3923 1.4109 1.4295 2.3756 1.3607 1.8211 1.7948 3.5120 2.5201 1.7904 2.2181 1.9590 1.8651 1.1467 1.4942 1.7681 3.6778 2.6386 3.7737 4.8719 5.4243 6.1649 1.2104 10.4478 1.7068 1.5936 2.3494 1.1594 1.0781 1.0838 2.5429 1.1395 6.8370 7.9998 9.5139 7.1685 7.6662 8.0690 6.9564 1.0378 1.0319 1.0955 1.1014 1.1031 1.1013 1.0866 1.0886 1.0904 1.0946 1.1001 1.0974
irintensity: 3.9236 1.0664 3.3645 0.8454 2.5334 1.8560 2.1354 0.4049 2.0695 3.1203 0.9619 6.1937 1.5213 1.7518 1.8859 4.0070 0.5209 3.5107 5.8602 3.4305 15.1703 2.8074 1.7015 4.2005 1.3522 9.8502 7.8172 2.4770 23.9030 14.5737 10.5090 15.3076 2.1605 4.4778 2.0561 34.3996 11.0992 32.0024 6.5796 40.2897 27.1788 4.1691 23.8846 41.7875 0.5562 41.6299 1.9242 4.7037 7.5734 0.3401 14.2974 2.3480 32.5133 1.9339 61.3194 38.9014 102.2544 4.9703 10.7537 15.6798 4.8794 644.2147 59.7392 120.7445 135.2771 10.8342 180.0157 37.8725 5.5858 40.0536 70.4546 10.6205 13.8237 27.8333 9.4491 5.9984 51.7413 53.8247 46.3864 247.7199 23.3316 226.5280 44.8971 0.6152 4.2853 24.5822 7.1945 10.3227 4.0433 16.2179 3.5368 1.7246 6.9251 0.8424 29.7544 3.5780
temp: 298.150 k
press: 1.00000 atm
elementType: 35 8 8 8 7 6 6 6 6 6 6 6 6 6 6 6 6 6 6 6 6 6 1 1 1 1 1 1 1 1 1 1 1 1
symmnumber: 1
zpe: 645999.1 jmol-1
zpe.correction: 0.246048 hartree
zpe.thermalcorrener: 0.265499 hartree
zpe.thermalcorrenthalpy: 0.266443 hartree
zpe.thermalcorrgfe: 0.196245 hartree
zpe.sumelectzpe: -947.378264 hartree
zpe.sumelectthermal: -947.358813 hartree
zpe.sumelectthermalent: -947.357869 hartree
zpe.sumelectthermalfe: -947.428067 hartree
dipole: 1.8568 0.3406 -0.1468
dipole: 1.8935
quadrupole: -162.7941 -113.7557 -133.9903
quadrupole: 20.6315 -1.1183 2.0897
quadrupole: -25.9474 23.0910 2.8564 20.6315 -1.1183 2.0897
hfenergy: -947.6243118 hartree
pointgroup: C01 [X(C17H12Br1N1O3)]
dipole: -0.7083272 0.2287294 -0.0304919 debye
polarizability: 327.5974427|-9.3493317|288.5836481|-16.2764189|-20.4855963|107.2827189 unknown
InChI: InChI=1S/C17H12BrNO3/c1-9(20)19(2)13-8-7-12(18)14-15(13)17(22)11-6-4-3-5-10(11)16(14)21/h3-8H,1-2H3
charge 0 multiplicity 1
34 atoms
Br -0.701206 4.381862 -0.593476
O  0.425091 -2.17218 -0.138926
O  -2.6473 2.368288 0.282258
O  4.57897 -2.016793 -0.035811
N  2.699454 -0.719789 0.372344
C  0.392507 0.247829 0.060033
C  -0.425535 1.43811 -0.049851
C  1.822637 0.358955 0.050467
C  -1.739231 -1.190983 0.126637
C  -2.534049 -0.018247 0.206521
C  -0.254887 -1.108024 0.027838
C  -1.918068 1.33928 0.144635
C  0.217479 2.678517 -0.313686
C  2.413445 1.623352 -0.20317
C  1.625721 2.76046 -0.416499
C  -2.357534 -2.46646 0.163427
C  -3.942005 -0.127571 0.331245
C  2.519236 -1.457979 1.645599
C  -3.75666 -2.569561 0.284057
C  -4.551111 -1.396597 0.370638
C  3.760909 -1.147886 -0.456907
C  3.858551 -0.585027 -1.871421
H  3.503942 1.711098 -0.192178
H  2.098098 3.72592 -0.616942
H  -1.72012 -3.353435 0.098373
H  -4.529548 0.793623 0.390359
H  1.882704 -0.866355 2.32232
H  3.512484 -1.614537 2.097025
H  2.054788 -2.440454 1.459548
H  -4.232699 -3.555371 0.313115
H  -5.639026 -1.479144 0.464914
H  4.609145 0.224968 -1.916787
H  2.902673 -0.203395 -2.262423
H  4.219849 -1.399473 -2.519175
