program: Gaussian 09
title: 000080745
version: EM64L-G09RevD.01
frameworkgroup: C1[X(C20H14N2O4)]
method: RPBEPBE
basis: SDD
operation: Freq
keyword: #p
keyword: freq=noraman
keyword: PBEPBE/SDD
title: #p freq=noraman PBEPBE/SDD
converged: YES YES NO NO
title: Mulliken charges:
elementType: O O O O N N C C C C C C C C C C C C C C C C C C C C H H H H H H H H H H H H H H
charge: -0.480019 -0.462223 -0.385759 -0.385841 -0.489320 -0.664379 0.112801 0.136911 0.174811 0.143728 0.002113 -0.012141 0.267048 0.059189 0.297870 0.046402 -0.362270 -0.364698 -0.399421 -0.335647 0.435643 -0.429939 -0.386527 -0.196465 -0.218237 -0.251787 0.276704 0.261983 0.397619 0.230354 0.260898 0.401640 0.307424 0.399035 0.248473 0.268928 0.403346 0.229908 0.229209 0.232638
chargesum: 0.00000
title: Mulliken charges with hydrogens summed into heavy atoms:
elementType: O O O O N N C C C C C C C C C C C C C C C C C C C C
charge: -0.480019 -0.462223 0.013276 0.017504 -0.091701 0.044685 0.112801 0.136911 0.174811 0.143728 0.002113 -0.012141 0.267048 0.059189 0.297870 0.046402 -0.085566 -0.102715 -0.169067 -0.074750 0.435643 -0.181466 -0.117599 0.033443 0.010972 -0.019149
polarizability: 5.94043390e+02 5.14694894e+01 3.18979729e+02 -6.80775742e+00 9.41856409e+00 1.08929326e+02
1716.lowfreq: -8.7810 -0.0005 0.0004 0.0006 2.7900 3.8599 30.1917 38.8208 57.4632
frequency: 30.1653 38.7871 57.4423 78.9258 86.8452 147.6348 153.3850 163.6725 166.6992 209.1637 224.2071 239.3561 261.3434 307.2562 333.6066 352.8927 356.3666 374.2341 409.4181 414.0605 427.8533 436.6436 450.2263 467.3507 477.0042 478.4968 485.6507 495.8651 509.3935 514.9686 542.2434 548.1439 570.8847 593.2047 612.4164 643.3389 667.0275 694.2645 707.5121 722.7344 737.6515 743.2965 761.2412 792.2473 799.8873 817.1832 817.3877 827.8632 829.8736 846.0946 850.7179 889.7419 915.8605 955.4912 957.4009 961.1920 963.7799 977.9751 981.5335 987.3960 992.0633 1006.8253 1017.2602 1025.7456 1065.9675 1085.9946 1133.7099 1168.5194 1172.8434 1175.7504 1187.8712 1236.5074 1254.3841 1264.9911 1271.6146 1285.9121 1305.8854 1320.2199 1340.4717 1350.0781 1355.1772 1368.0126 1389.6086 1425.1019 1434.6217 1443.2445 1445.2733 1469.0298 1471.8012 1483.7806 1509.6871 1515.8659 1543.8646 1568.8073 1584.2581 1601.7550 1613.7024 1616.6752 1634.8029 1636.5829 2492.2180 2536.8614 3070.3904 3129.0160 3133.1845 3134.2888 3148.2766 3157.0534 3162.1629 3171.0706 3175.4449 3182.2194 3288.8949 3627.6099
redmass: 5.9001 4.2021 5.5306 6.3864 6.1132 5.6894 7.1194 8.5466 5.9806 7.4369 5.9397 5.7422 5.7732 6.1541 5.9735 5.0788 5.2317 4.9166 2.9642 5.6685 7.1496 8.4763 8.7489 6.9162 2.8211 2.0061 10.1849 3.1648 3.6207 5.2781 3.9531 6.5456 5.5861 3.2922 6.3044 5.7727 5.8066 2.3079 5.2798 7.0772 3.8364 4.7393 2.3944 5.5818 4.4465 2.5822 2.1402 1.5118 1.3814 1.3196 4.1653 1.3239 1.4279 6.9729 1.3458 4.1242 1.4394 1.6111 3.6518 3.1670 1.4033 1.0683 1.0622 2.1005 1.8325 1.5613 1.5543 1.3266 1.0576 2.1824 1.1235 3.2786 1.8587 2.8960 2.3421 5.6606 3.2173 1.6391 3.6890 2.9218 3.5409 3.9156 6.0996 5.4596 6.5075 3.1053 3.6745 4.5300 2.0152 2.3680 3.9937 5.0679 2.1540 2.7601 5.3249 5.0701 4.8419 1.6683 3.9934 2.4250 1.0731 1.0719 1.0824 1.0851 1.0895 1.0882 1.0930 1.0942 1.0895 1.1013 1.0957 1.0970 1.0615 1.0902
irintensity: 1.1257 0.7646 0.6005 2.9913 0.2160 0.2538 0.6682 0.3194 1.1041 1.2104 1.7628 1.7686 1.3079 1.1187 3.4684 1.2656 0.3434 1.7600 0.7385 1.8046 0.4848 1.4103 8.8985 7.4745 39.2731 62.4719 19.5067 25.4202 17.2549 11.1012 21.9211 16.5443 2.6233 5.0297 1.3254 7.3378 2.4937 29.2043 11.6696 0.8709 29.7003 5.7266 53.5896 11.7289 3.4526 49.8483 76.6794 43.7763 6.4880 15.2435 20.3062 64.9541 23.6320 53.1540 1.9294 2.9388 2.7047 0.8099 0.2052 0.1629 0.9073 132.2828 176.1573 13.5471 11.1351 11.3336 38.3715 3.2850 0.2547 62.0969 2.1540 65.5784 177.4128 15.0464 53.0316 41.3300 414.5650 10.1488 9.5462 423.2293 131.6095 78.3351 61.2418 78.5907 47.9231 22.6185 10.0953 97.4610 262.3845 77.7772 36.2915 400.6918 289.8362 6.2307 17.6699 465.8846 50.7170 72.9727 1.7469 190.6028 58.2193 75.8945 29.5833 11.2191 16.3059 2.3404 19.4094 25.3577 5.0991 24.6358 11.3618 6.3816 64.8029 97.1505
temp: 298.150 k
press: 1.00000 atm
elementType: 8 8 8 8 7 7 6 6 6 6 6 6 6 6 6 6 6 6 6 6 6 6 6 6 6 6 1 1 1 1 1 1 1 1 1 1 1 1 1 1
symmnumber: 1
zpe: 777856.5 jmol-1
zpe.correction: 0.296270 hartree
zpe.thermalcorrener: 0.315870 hartree
zpe.thermalcorrenthalpy: 0.316814 hartree
zpe.thermalcorrgfe: 0.248490 hartree
zpe.sumelectzpe: -1179.232774 hartree
zpe.sumelectthermal: -1179.213174 hartree
zpe.sumelectthermalent: -1179.212230 hartree
zpe.sumelectthermalfe: -1179.280554 hartree
dipole: -0.5072 -0.1747 0.1888
dipole: 0.5687
quadrupole: -101.0107 -162.3555 -153.1326
quadrupole: 5.7399 -1.2875 3.9558
quadrupole: 37.8223 -23.5226 -14.2997 5.7399 -1.2875 3.9558
hfenergy: -1179.5290439 hartree
pointgroup: C01 [X(C20H14N2O4)]
dipole: -0.2008133 -0.0694988 0.0700248 debye
polarizability: 595.2630216|48.3191484|316.6063958|-1.3978223|18.7110318|110.0830273 unknown
InChI: InChI=1S/C20H14N2O4/c21-11-6-8-13(23)17-15(11)19(25)18-14(24)9-7-12(16(18)20(17)26)22-10-4-2-1-3-5-10/h1-9,22-24H,21H2
charge 0 multiplicity 1
40 atoms
O  0.175184 -2.017079 -0.208119
O  -3.218124 2.377639 0.104626
O  -1.300003 3.938904 0.02702
O  -1.745782 -3.580566 -0.129404
N  2.225646 -0.446077 -0.166112
N  -5.275574 0.774099 0.188472
C  -0.067354 0.394286 -0.083749
C  -0.978369 1.511246 -0.026582
C  -2.96577 -0.032203 0.043706
C  -2.059101 -1.15074 -0.0353
C  -0.6170 -0.948212 -0.109556
C  -2.424411 1.311433 0.041863
C  1.356803 0.633636 -0.120555
C  -0.473003 2.848943 -0.032865
C  -4.383584 -0.269809 0.11484
C  -2.56896 -2.487125 -0.047904
C  1.82102 1.994006 -0.169756
C  0.93408 3.066436 -0.128393
C  -4.858187 -1.628084 0.107034
C  -3.978396 -2.70438 0.02723
C  3.63579 -0.468199 -0.007932
C  4.361563 -1.470583 -0.710079
C  4.335519 0.402409 0.873502
C  5.757039 -1.585226 -0.549606
C  5.734028 0.285418 1.018456
C  6.455265 -0.701731 0.307348
H  2.890223 2.187747 -0.282351
H  1.291064 4.098986 -0.181648
H  1.71645 -1.357052 -0.268973
H  -5.937843 -1.809934 0.163683
H  -4.339056 -3.736954 0.019253
H  -4.872638 1.726648 0.18626
H  -6.276991 0.599776 0.235702
H  -2.279961 3.547866 0.074995
H  3.823945 -2.145001 -1.386192
H  3.786611 1.13056 1.478204
H  -0.767502 -3.195412 -0.181238
H  6.301025 -2.360919 -1.099663
H  6.258708 0.957854 1.706344
H  7.540148 -0.788504 0.42724
