program: Gaussian 09
title: 000080644
version: EM64L-G09RevD.01
frameworkgroup: C1[X(C4H11NO2S)]
method: RPBEPBE
basis: SDD
operation: Freq
keyword: #p
keyword: freq=noraman
keyword: PBEPBE/SDD
title: #p freq=noraman PBEPBE/SDD
converged: YES YES NO NO
title: Mulliken charges:
elementType: S O O N C C C C H H H H H H H H H H H
charge: 1.028880 -0.556502 -0.556375 -0.276472 -0.514738 -0.623590 -0.601778 -0.602394 0.254037 0.255437 0.227769 0.255427 0.256685 0.198153 0.279452 0.249636 0.278496 0.198003 0.249874
chargesum: 0.00000
title: Mulliken charges with hydrogens summed into heavy atoms:
elementType: S O O N C C C C
charge: 1.028880 -0.556502 -0.556375 -0.276472 -0.005264 0.116291 0.125463 0.123980
polarizability: 1.05511025e+02 3.10015381e-02 8.05060550e+01 -1.71701059e-01 2.66443409e-01 7.28730369e+01
1716.lowfreq: -17.1331 -0.0019 -0.0018 0.0012 5.3997 8.3924 34.3135 55.5706 85.1533
frequency: 34.2284 55.4820 85.0255 170.8017 185.0978 199.6060 224.2134 230.7831 238.5671 258.2681 284.6264 340.8999 380.4925 394.9212 500.7294 517.8658 779.7289 813.7819 864.4245 933.7218 971.1115 1026.7738 1042.0937 1061.8007 1081.7573 1104.3945 1189.8374 1213.7655 1235.6928 1245.5541 1391.6063 1408.8973 1410.2829 1420.2406 1459.2496 1461.5851 1464.4153 1474.7131 1477.3317 1482.3826 2906.1408 2909.8382 2990.9776 3034.1616 3034.8370 3044.5639 3085.0344 3091.8672 3093.6079 3105.2624 3138.8330
redmass: 2.4754 2.8781 2.9418 3.6514 1.4406 4.4106 1.0427 1.7441 1.7774 1.9826 5.0145 5.0310 4.4636 2.9748 5.2367 10.0495 1.1999 14.1311 4.1768 3.8828 1.5312 1.3549 1.5595 2.6818 1.2253 1.3428 6.0149 1.7031 1.2582 1.2503 1.1671 1.1266 1.1231 1.1402 1.0357 1.0450 1.0515 1.0475 1.0508 1.0509 1.0485 1.0480 1.0367 1.0851 1.0832 1.0569 1.0965 1.0982 1.0992 1.1021 1.1098
irintensity: 0.1391 0.3959 3.5120 6.1577 0.3880 0.9664 0.3393 10.8268 4.1908 0.4057 9.8449 13.5672 0.0247 4.4581 27.0202 85.1966 1.8981 75.2520 62.1897 79.1903 21.6102 4.7255 9.3860 11.9704 0.0791 19.2935 20.2219 12.4931 3.0406 8.3404 23.0479 21.2852 1.3706 0.5231 25.5294 12.9837 18.4682 13.5979 32.1179 15.0450 37.1060 132.7990 17.1496 4.8487 40.1226 8.3948 9.3388 1.3457 2.6557 2.9041 9.2332
temp: 298.150 k
press: 1.00000 atm
elementType: 16 8 8 7 6 6 6 6 1 1 1 1 1 1 1 1 1 1 1
symmnumber: 1
zpe: 398068.6 jmol-1
zpe.correction: 0.151616 hartree
zpe.thermalcorrener: 0.163141 hartree
zpe.thermalcorrenthalpy: 0.164085 hartree
zpe.thermalcorrgfe: 0.114081 hartree
zpe.sumelectzpe: -761.419406 hartree
zpe.sumelectthermal: -761.407881 hartree
zpe.sumelectthermalent: -761.406937 hartree
zpe.sumelectthermalfe: -761.456941 hartree
dipole: 1.0226 -0.3637 6.0331
dipole: 6.1299
quadrupole: -49.0750 -61.6041 -61.9298
quadrupole: 0.0434 -1.7989 -0.0224
quadrupole: 8.4613 -4.0678 -4.3935 0.0434 -1.7989 -0.0224
hfenergy: -761.5710221 hartree
pointgroup: C01 [X(C4H11N1O2S1)]
dipole: 0.4538836 1.0493577 2.123465 debye
dipolederiv: 1.5624723 0.0422508 0.0674794 0.0792486 1.1774018 0.0760573 0.123497 0.0756725 1.2869896 -0.5924899 0.0173341 -0.0215713 0.0615528 -0.5592337 0.1238243 -0.0072972 0.0376426 -0.6683883 -0.5896582 -0.0219695 0.0070058 -0.0443452 -0.7057085 -0.0751644 0.047817 0.0123966 -0.5239226 -0.3133968 -0.0033797 -0.0180119 -0.093048 -0.5499531 -0.0420591 -0.1902709 -0.0447412 -0.6093316 -0.0017965 -0.0556345 -0.1136437 -0.0594583 -0.0125158 -0.0240763 -0.1222424 -0.0223527 -0.0309489 -0.1630657 -0.0080791 0.0028029 0.1058159 -0.0026968 -0.0359918 0.2347298 -0.0267511 -0.0574996 -0.0913457 0.009451 -0.0925194 0.3181302 0.3226623 0.1794459 -0.0554468 0.1254375 0.1867664 -0.0792094 -0.085136 -0.0402431 -0.2389119 0.0811292 -0.0441994 0.226811 0.0186193 0.4181099 -0.0178933 0.0458814 -0.0231467 0.0646847 0.0351424 0.0318887 -0.0257522 0.0288055 -0.0621164 -0.0076475 -0.0428869 0.0273234 -0.0566642 -0.0620579 -0.0341328 0.0412829 -0.0312182 0.0275972 -0.0736759 0.0489541 0.1161215 0.02352 0.1047729 -0.0648089 0.066753 -0.0670731 -0.0077614 0.1019895 -0.0008815 -0.015481 0.0187426 0.0636208 0.0809658 -0.1031943 0.0881188 -0.0009342 0.1107724 0.0021916 -0.009468 -0.0797522 -0.0632188 -0.0005477 -0.0471367 -0.0143706 0.1239205 0.0735973 0.0045702 0.0670568 -0.0812067 -0.083365 -0.0716371 -0.0155156 -0.1884496 -0.1414586 0.151392 0.1053118 -0.0773843 0.0206528 0.0681393 0.0265488 -0.0463535 0.0537275 0.0328543 -0.1457556 -0.0532315 0.0508257 -0.0821488 0.0533047 -0.0253794 0.0149632 -0.0408084 0.1151165 0.1556322 -0.1198363 0.037378 -0.0448331 -0.0019899 0.011265 -0.0113076 -0.016846 0.0921378 0.0704059 0.0534919 0.0466697 0.0371093 0.0050694 -0.1231822 -0.0761659 -0.0118689 -0.2268723 -0.1503271 0.061598 -0.0111938 0.0509115 0.129497 0.0111831 -0.0551707 0.0240592 0.0457419 unknown
polarizability: 105.4578708|0.3946232|78.9021521|-1.1685122|-3.1459766|74.530094 unknown
InChI: InChI=1S/C4H11NO2S/c1-4-8(6,7)5(2)3/h4H2,1-3H3
charge 0 multiplicity 1
19 atoms
S  -0.2651 -0.17331 -0.44373
O  -0.600564 0.78564 -1.713777
O  -0.540907 -1.775862 -0.461967
N  1.57269 0.023333 -0.128567
C  -1.276567 0.546455 1.082002
C  -2.764203 0.335755 0.814015
C  2.009919 1.432475 -0.159562
C  2.052014 -0.816309 0.986352
H  -0.891099 -0.022219 1.943476
H  -0.970474 1.604139 1.120727
H  -3.348773 0.729473 1.666711
H  -3.083591 0.867503 -0.098397
H  -2.998413 -0.736359 0.700009
H  1.857083 1.979664 0.799024
H  1.481471 1.952205 -0.976722
H  3.089608 1.441326 -0.396071
H  1.56133 -1.802613 0.927349
H  1.89058 -0.372015 1.995639
H  3.137397 -0.970378 0.845387
