program: Gaussian 09
title: 000080650
version: EM64L-G09RevD.01
frameworkgroup: C1[X(C5H10O3)]
method: RPBEPBE
basis: SDD
operation: Freq
keyword: #pfreq=noraman
keyword: PBEPBE/SDD
title: #p freq=noraman PBEPBE/SDD
converged: YES YES NO NO
title: Mulliken charges:
elementType: O O O C C C C C H H H H H H H H H H
charge: -0.251275 -0.293293 -0.196574 -0.042781 0.189048 -0.737292 -0.533166 -0.498134 0.228382 0.235830 0.267523 0.245174 0.256604 0.221506 0.229374 0.237806 0.232757 0.208511
chargesum: 0.00000
title: Mulliken charges with hydrogens summed into heavy atoms:
elementType: O O O C C C C C
charge: -0.251275 -0.293293 -0.196574 0.185600 0.189048 0.011235 0.174317 0.180941
polarizability: 6.81760896e+01 -2.73456657e+00 7.21287568e+01 -2.39126596e-01 -2.54934163e-01 5.00166701e+01
1716.lowfreq: -10.7994 -1.9151 -0.0013 -0.0004 0.0004 7.7141 43.3827 95.6754 110.2956
frequency: 43.2532 95.6515 110.2635 136.6543 148.1312 178.9467 201.8846 233.0077 301.1416 362.4775 391.5483 501.9358 547.2880 634.6111 796.1605 865.9443 884.7086 956.7431 1000.6345 1027.2254 1064.7200 1109.6799 1112.2462 1141.6814 1159.2896 1194.5672 1287.4213 1326.9997 1366.8731 1417.9870 1427.1525 1434.3592 1442.4905 1453.3143 1458.3788 1477.7771 1487.8015 1647.1454 2942.7640 2957.1661 2982.6509 2989.8463 3054.7454 3074.0049 3087.0158 3119.8684 3122.7704 3126.4395
redmass: 4.2407 2.1761 1.3590 1.0515 1.1679 2.0255 3.2212 4.0394 3.4942 5.1804 3.8288 3.3222 4.3832 4.2344 2.5251 4.6266 5.1331 2.2908 4.4151 2.6384 4.6359 1.2664 1.2604 1.3817 1.4120 2.4471 1.4670 1.2450 1.2442 1.1351 1.1356 1.0647 1.0648 1.0520 1.0540 1.0523 1.0514 8.9100 1.0812 1.0353 1.0315 1.0362 1.0987 1.0949 1.1018 1.1017 1.1036 1.1020
irintensity: 3.5966 2.5794 3.4651 0.7037 0.3342 9.5735 1.4681 16.6742 4.8727 0.9571 3.6711 5.3937 21.9812 7.2174 2.8084 33.3199 39.2957 32.1918 131.1167 55.9521 116.4334 3.5715 0.9446 2.1850 3.4278 36.0373 2.4149 3.9169 59.5831 8.2225 1.6785 38.0447 24.9791 10.4553 5.5647 18.4016 10.5859 103.9432 46.4998 63.5609 41.5724 2.6855 44.3122 8.0062 28.3454 20.9480 21.3957 16.6342
temp: 298.150 k
press: 1.00000 atm
elementType: 8 8 8 6 6 6 6 6 1 1 1 1 1 1 1 1 1 1
symmnumber: 1
zpe: 382119.4 jmol-1
zpe.correction: 0.145542 hartree
zpe.thermalcorrener: 0.155825 hartree
zpe.thermalcorrenthalpy: 0.156770 hartree
zpe.thermalcorrgfe: 0.109741 hartree
zpe.sumelectzpe: -421.495393 hartree
zpe.sumelectthermal: -421.485109 hartree
zpe.sumelectthermalent: -421.484164 hartree
zpe.sumelectthermalfe: -421.531193 hartree
dipole: 2.0568 -2.4150 -0.5131
dipole: 3.2134
quadrupole: -48.2286 -47.0390 -48.1287
quadrupole: 3.3552 -0.2759 -4.7629
quadrupole: -0.4298 0.7598 -0.3300 3.3552 -0.2759 -4.7629
hfenergy: -421.6409341 hartree
pointgroup: C01 [X(C5H10O3)]
dipole: -0.7190824 -0.9266589 -0.4717707 debye
dipolederiv: -0.5351583 0.1173516 0.1928401 -0.0405031 -0.6336135 -0.2626148 0.1260515 -0.2790927 -0.8720289 -0.8664763 -0.2731606 -0.1359981 -0.2128512 -0.7531439 -0.263688 -0.027279 -0.0623337 -0.4736328 -0.6424334 -0.1258385 -0.1052474 -0.0725613 -0.632664 -0.2347717 -0.0741669 -0.2565265 -0.4677211 0.4240145 0.0359096 -0.2598204 0.2708756 1.0336285 0.4449544 -0.2772758 0.1499861 0.6671904 0.8749775 -0.0839213 0.1068124 -0.1393626 0.7381729 0.3698307 0.119812 0.4222347 0.3582359 -0.1232445 0.1616041 0.0902048 0.1938879 -0.4177263 -0.199663 0.0612907 -0.1589406 -0.0549387 0.240761 0.0327197 -0.007878 0.0579336 0.1972344 -0.021548 -0.0559914 0.1167862 0.5758797 0.5758804 0.1606549 0.1377884 0.0219403 0.2195074 0.0201331 0.1202029 0.0629731 0.3832198 0.0151725 0.0139742 -0.0106313 -0.0522908 -0.0133533 0.0041391 0.0552202 0.0520459 -0.1645887 0.0949817 0.0406125 -0.06648 0.001625 0.1221534 0.0213049 -0.0471425 -0.0257506 -0.0822833 0.1140022 -0.0353671 0.06601 -0.0528349 0.0374097 0.0487051 0.0286151 0.0735948 0.0877878 -0.1308613 0.0275845 -0.0025926 -0.0159963 0.0942949 -0.0257496 -0.0318191 -0.0261342 0.0985594 -0.0494539 -0.0641026 -0.1343049 -0.0403238 0.0979785 0.0045147 -0.0495628 -0.0102156 0.006093 0.0697859 -0.0566108 0.0142603 -0.0753352 -0.1048311 0.1206023 0.0161042 0.01753 0.0002745 -0.0105848 0.1243832 0.0918536 0.1064299 0.0165143 -0.0730341 0.054166 -0.0557121 0.0243037 -0.0798485 0.0335026 0.0336969 0.1347235 0.0351835 -0.0578872 0.0718582 -0.0765892 0.0081202 0.0338745 -0.0627076 -0.0172589 -0.1036258 -0.1137407 0.0098088 -0.0127447 0.0304748 0.100485 -0.0053892 -0.0465886 0.0067451 0.0182692 0.0769954 0.0949633 -0.0773386 0.0256697 -0.1949558 unknown
polarizability: 67.6777661|2.6961303|62.9181803|0.5519664|11.0935874|59.72557 unknown
InChI: InChI=1S/C5H10O3/c1-4(6)5(7-2)8-3/h5H,1-3H3
charge 0 multiplicity 1
18 atoms
O  -0.835527 1.708456 0.284596
O  -0.702251 -0.620097 -0.379346
O  1.991424 1.449989 0.477546
C  -0.137165 0.722408 -0.497417
C  1.383925 0.577131 -0.189494
C  2.066453 -0.639959 -0.779635
C  -0.791287 1.505276 1.750129
C  -2.084614 -0.70557 -0.88004
H  -0.248703 1.09877 -1.539654
H  1.83893 -0.735332 -1.857615
H  1.660067 -1.549904 -0.301273
H  3.154607 -0.57813 -0.624049
H  0.211524 1.745148 2.141325
H  -1.069071 0.467047 2.012446
H  -1.534733 2.207951 2.156111
H  -2.754992 -0.031476 -0.316525
H  -2.388919 -1.753567 -0.737103
H  -2.128467 -0.444239 -1.957302
