program: Gaussian 09
title: 000080640
version: EM64L-G09RevD.01
frameworkgroup: C1[X(C10H12O)]
method: RPBEPBE
basis: SDD
operation: Freq
keyword: #pfreq=noraman
keyword: PBEPBE/SDD
title: #p freq=noraman PBEPBE/SDD
converged: YES YES NO NO
title: Mulliken charges:
elementType: O C C C C C C C C C C H H H H H H H H H H H H
charge: -0.292971 0.351591 -0.588135 0.241464 0.194118 -0.713172 -0.731464 -0.393422 -0.369250 -0.250139 -0.202998 0.238911 0.233553 0.206921 0.236344 0.234662 0.208076 0.232114 0.233161 0.236303 0.246305 0.223211 0.224815
chargesum: 0.00000
title: Mulliken charges with hydrogens summed into heavy atoms:
elementType: O C C C C C C C C C C
charge: -0.292971 0.351591 -0.115672 0.241464 0.194118 -0.035244 -0.058113 -0.157119 -0.122944 -0.026927 0.021817
polarizability: 1.45177135e+02 2.21954783e+00 1.05812939e+02 -1.91262749e+00 -2.09406785e-01 6.70232924e+01
1716.lowfreq: -13.1221 -0.0007 -0.0006 -0.0004 10.9755 13.3602 47.7413 150.2896 201.0431
frequency: 47.6169 150.2811 201.0401 234.9662 236.5220 276.2987 301.4609 332.6437 417.5679 434.7248 460.9034 495.2071 534.3485 585.4454 627.0350 706.2873 733.3612 754.3576 781.2837 835.0754 851.9286 854.2394 907.5107 928.3702 940.5386 967.6494 970.0957 1006.0470 1015.5442 1077.0277 1109.7552 1134.4980 1163.6063 1178.3476 1225.2802 1242.6181 1247.7080 1276.0067 1301.5967 1380.9363 1395.0041 1398.8897 1445.7195 1451.1933 1461.9848 1463.6239 1470.7907 1472.4108 1483.7433 1604.4431 1616.8339 2983.0925 2984.6044 2990.2319 3046.8228 3079.9564 3086.9622 3094.8414 3099.2295 3125.3520 3135.8935 3157.4331 3172.6128
redmass: 3.3423 2.9931 1.0702 1.4575 2.4514 2.1053 2.5621 2.5466 2.8607 2.7973 2.7614 4.0371 3.6597 6.5263 5.5403 3.0575 5.9290 1.4056 4.1634 2.8072 4.1999 1.5453 1.7325 1.4051 1.3870 1.6744 1.3282 1.3839 2.0873 2.1827 1.3444 1.6368 1.0961 2.1574 1.8309 2.9505 2.4387 2.0544 1.7544 1.2515 2.0231 2.0918 2.4398 1.0580 1.2095 1.0579 1.1472 2.0192 1.0572 7.1657 7.6258 1.0446 1.0499 1.0395 1.1000 1.0992 1.0990 1.1006 1.1000 1.0861 1.0905 1.0956 1.0982
irintensity: 0.5731 1.6155 0.1819 2.1752 2.7768 1.2371 0.6644 3.6602 5.0979 3.7585 0.3208 0.2880 0.1470 2.6601 0.7958 4.1521 18.6666 94.0466 8.6932 3.6491 45.7289 12.2161 0.6058 3.1485 0.8650 3.2059 0.2192 0.3915 12.0327 34.4316 6.7038 61.5208 2.9992 1.4890 14.4418 65.0959 66.5540 10.7770 24.1535 32.1001 5.0112 20.7912 27.5150 3.0911 16.3424 4.8967 24.3742 59.0895 11.9496 17.8680 18.6979 23.4485 13.3992 34.3789 16.2106 14.8238 32.3188 14.3779 39.8014 1.5480 17.1160 30.1800 12.9049
temp: 298.150 k
press: 1.00000 atm
elementType: 8 6 6 6 6 6 6 6 6 6 6 1 1 1 1 1 1 1 1 1 1 1 1
symmnumber: 1
zpe: 503313.2 jmol-1
zpe.correction: 0.191702 hartree
zpe.thermalcorrener: 0.201538 hartree
zpe.thermalcorrenthalpy: 0.202482 hartree
zpe.thermalcorrgfe: 0.156919 hartree
zpe.sumelectzpe: -462.678812 hartree
zpe.sumelectthermal: -462.668976 hartree
zpe.sumelectthermalent: -462.668032 hartree
zpe.sumelectthermalfe: -462.713594 hartree
dipole: 1.1183 1.6951 0.2194
dipole: 2.0426
quadrupole: -58.5772 -62.9190 -68.2905
quadrupole: 2.6027 -0.0916 -0.4708
quadrupole: 4.6851 0.3432 -5.0282 2.6027 -0.0916 -0.4708
hfenergy: -462.8705136 hartree
pointgroup: C01 [X(C10H12O1)]
dipole: 0.4370765 -0.6682663 -0.0903727 debye
dipolederiv: -1.6202542 -0.063892 0.028918 -0.0917025 -0.3839322 -0.0368645 -0.051492 -0.0326835 -0.3424412 0.8988914 -0.0535706 -0.0237562 -0.3747279 0.2580304 0.0306396 -0.0698941 0.0122431 0.4642985 -0.1832197 -0.102743 -0.0065326 0.027119 -0.019259 0.0169162 -0.019105 0.0305669 0.1282861 -0.0145673 -0.0057269 0.0158194 -0.5370893 -0.0843119 -0.0146161 0.0459703 -0.020268 -0.1036235 1.2370939 0.1967508 -0.0101603 0.6403531 0.0820048 -0.009886 0.0774767 0.0062702 0.0613955 -0.0586163 -0.0228098 0.0271794 0.0416394 0.0629777 0.0281649 0.0685624 -0.0024719 -0.1739792 -0.0880133 -0.0117858 -0.0599707 0.0076855 0.0696436 -0.0216757 -0.0844763 0.0030339 -0.0768271 0.1415505 -0.0524482 0.0038047 0.0836782 0.1364179 0.0057768 0.0083142 0.0017043 -0.1406156 -0.327743 -0.136074 0.0057769 0.0754971 0.0717605 0.005976 0.0073225 -0.0008786 -0.1874859 -0.1057951 0.0694637 0.0173185 0.1158331 -0.1701423 0.0104813 0.0058093 0.0117255 -0.2023944 0.0941133 0.0690898 0.0146837 -0.058933 0.1400272 0.0005752 0.0138848 0.0067713 -0.1507335 -0.0050674 0.0502626 -0.0272225 0.0354149 0.0318074 0.0759406 -0.0575087 0.1169805 -0.0946595 0.0203265 0.0566505 0.0191719 0.0671831 -0.0212784 -0.0856997 0.0602109 -0.1260988 -0.0014331 -0.0410968 0.1003993 0.0444845 0.1494964 -0.0386654 -0.0338546 0.0531955 0.0080956 0.0715541 -0.0175706 -0.0152475 -0.1323923 -0.0226851 0.0831739 -0.0169967 -0.1092766 -0.0139917 -0.0241556 0.0439014 -0.085215 0.0368328 -0.1285224 -0.0728835 0.0479207 0.0128835 -0.0024923 0.0746669 -0.0395484 0.0862357 -0.0071809 0.1457104 -0.045785 -0.0127631 0.0027919 -0.0427226 0.0840376 0.0199779 -0.0811401 -0.0066253 -0.1473411 -0.065378 0.0124201 0.0103124 0.0536616 0.0836508 0.0583771 -0.0018764 0.0951532 -0.0168003 0.0922548 0.0104564 0.0600785 0.0045042 -0.1185248 0.0863986 0.0086672 -0.0024639 -0.0258706 -0.1160327 -0.0035997 -0.0005592 -0.0042239 0.1504779 0.0919424 -0.0275381 -0.0053352 -0.0041202 -0.076568 -0.0048539 -0.0027227 -0.0028595 0.172701 -0.108592 -0.0815233 -0.0170958 -0.0865609 0.0420042 -0.0077099 -0.0184097 -0.0099629 0.1688493 -0.0824891 0.1040713 -0.0104074 0.104743 0.0241342 0.003252 -0.0133688 0.0030966 0.1569559 unknown
polarizability: 145.127248|-2.4425472|105.8373853|2.363701|0.154895|67.0487332 unknown
InChI: InChI=1S/C10H12O/c1-10(2)7-8-5-3-4-6-9(8)11-10/h3-6H,7H2,1-2H3
charge 0 multiplicity 1
23 atoms
O  0.970954 1.135321 0.177951
C  1.917611 -0.058525 -0.00757
C  1.010602 -1.322711 0.191502
C  -0.401274 -0.772519 0.06351
C  -0.339481 0.641911 0.089152
C  2.456619 0.045048 -1.445301
C  3.013837 0.095912 1.051193
C  -1.649216 -1.41328 -0.018147
C  -1.490386 1.448793 0.041273
C  -2.827883 -0.622917 -0.073786
C  -2.743022 0.790378 -0.040245
H  1.172409 -1.769951 1.191561
H  1.242585 -2.097031 -0.561628
H  3.19096 -0.757925 -1.643108
H  1.633106 -0.046162 -2.175722
H  2.951126 1.019446 -1.599295
H  3.736334 -0.737995 0.980398
H  3.560833 1.043904 0.908108
H  2.576859 0.097306 2.064577
H  -1.716756 -2.507268 -0.035991
H  -1.413236 2.539579 0.064075
H  -3.807194 -1.108505 -0.141939
H  -3.659686 1.389593 -0.082069
