program: Gaussian 09
title: 000080587
version: EM64L-G09RevD.01
frameworkgroup: C1[X(C13H12O)]
method: RPBEPBE
basis: SDD
operation: Freq
keyword: #pfreq=noraman
keyword: PBEPBE/SDD
title: #p freq=noraman PBEPBE/SDD
converged: NO YES NO NO
title: Mulliken charges:
elementType: O C C C C C C C C C C C C C H H H H H H H H H H H H
charge: -0.225812 0.358285 0.395606 0.302679 -0.545357 -0.431011 -0.366517 0.121625 -0.481608 -0.406508 -0.408630 -0.241454 -0.235053 -0.687061 0.284933 0.237728 0.245002 0.230811 0.230818 0.246829 0.241237 0.232106 0.230809 0.230929 0.208812 0.230802
chargesum: 0.00000
title: Mulliken charges with hydrogens summed into heavy atoms:
elementType: O C C C C C C C C C C C C C
charge: -0.225812 0.358285 0.395606 0.302679 -0.260424 -0.193283 -0.121515 0.121625 -0.019979 -0.159678 -0.167392 -0.009349 -0.004244 -0.016519
polarizability: 2.42897921e+02 5.13487404e+00 1.44046838e+02 -3.37475398e-02 -8.74207644e-03 6.46950923e+01
1716.lowfreq: 0.0004 0.0006 0.0008 2.9362 11.3536 17.1935 35.4208 75.8223 97.2369
frequency: 35.2402 75.7558 97.2229 125.3917 183.1410 197.8747 245.8094 254.9545 287.9739 353.3886 390.9481 465.9481 484.2948 490.6943 512.9864 560.0293 568.2689 626.2129 657.6662 701.9503 756.7902 758.7638 787.1320 804.6711 828.7212 836.0699 885.1443 929.9156 950.7442 970.7710 983.5451 985.0254 997.4961 1021.2953 1030.1195 1068.1790 1087.5708 1130.9360 1164.3018 1174.7737 1181.3981 1236.6054 1242.2809 1261.3840 1274.9532 1326.1733 1355.5519 1396.7877 1410.5598 1423.2689 1433.0082 1437.4484 1463.2473 1469.7541 1478.2651 1513.7011 1565.4989 1588.9729 1606.6406 1641.0571 2963.6693 2996.5358 3009.9721 3092.5599 3101.0961 3122.4910 3125.7240 3129.5848 3137.3340 3145.0371 3156.1363 3163.5164
redmass: 4.4444 2.3061 3.1195 4.0015 2.9523 1.3524 3.5320 4.7681 4.1121 5.1973 3.0726 2.9694 2.6759 4.9641 6.8738 2.5724 6.5210 6.3264 2.6037 3.9589 1.2548 4.8399 2.3163 1.5419 5.4115 1.3653 1.5765 4.8674 1.4116 1.4226 1.4209 2.4465 1.3573 2.1955 1.8311 1.6719 2.4997 1.7130 1.3847 1.0855 1.5533 2.3298 1.1896 1.6363 1.7374 2.0414 1.8847 1.2117 5.7424 2.8289 1.3886 2.6145 2.3147 1.0392 1.0530 3.5714 7.2294 7.5414 6.0626 7.0496 1.0600 1.0364 1.0979 1.1002 1.0998 1.0861 1.0879 1.0886 1.0913 1.0953 1.0958 1.1005
irintensity: 1.8947 2.4022 0.1416 1.2694 1.4305 0.3457 0.1959 2.3860 4.4880 7.0931 0.0863 7.0514 18.3915 5.6725 0.7146 0.1398 8.3066 1.3604 0.1509 2.1019 22.7782 0.0286 17.3321 65.7614 15.5772 20.4080 11.7555 15.9146 4.7507 4.6743 11.8213 15.1737 0.0506 1.8394 19.8336 2.0927 3.3398 27.1031 12.9898 1.2692 175.6317 3.6503 0.2069 20.8390 12.8825 53.0041 32.2290 24.6781 6.0211 14.1439 13.8206 2.4220 31.9331 11.7820 18.3793 11.0707 74.3935 51.8864 31.0272 12.7706 37.5103 34.6915 10.5974 28.8549 30.8025 1.4589 7.4915 0.6937 1.1654 28.3843 20.1279 32.8274
temp: 298.150 k
press: 1.00000 atm
elementType: 8 6 6 6 6 6 6 6 6 6 6 6 6 6 1 1 1 1 1 1 1 1 1 1 1 1
symmnumber: 1
zpe: 549791.3 jmol-1
zpe.correction: 0.209404 hartree
zpe.thermalcorrener: 0.221359 hartree
zpe.thermalcorrenthalpy: 0.222303 hartree
zpe.thermalcorrgfe: 0.170726 hartree
zpe.sumelectzpe: -576.840058 hartree
zpe.sumelectthermal: -576.828103 hartree
zpe.sumelectthermalent: -576.827159 hartree
zpe.sumelectthermalfe: -576.878737 hartree
dipole: -1.9349 2.7817 0.0030
dipole: 3.3884
quadrupole: -73.3248 -77.5442 -86.3452
quadrupole: 9.0255 0.0029 -0.0114
quadrupole: 5.7466 1.5272 -7.2738 9.0255 0.0029 -0.0114
hfenergy: -577.0494622 hartree
pointgroup: C01 [X(C13H12O1)]
dipole: 0.7613675 1.0942986 0.0006927 debye
dipolederiv: -0.9373978 -0.0814599 -0.0004425 -0.518485 -0.7717725 -0.0003133 -0.0008067 -0.0001978 -0.2981183 -0.0686149 -0.1166103 -0.0002127 -0.1171328 -0.1010546 -0.0002089 -0.0001956 -0.0002421 0.0278207 0.2371415 -0.0925776 -0.000114 -0.0231122 -0.0935478 -0.0002359 0.000008 -0.0002254 0.049281 -1.0534092 0.0041092 -0.0003755 0.0428423 -0.0531642 0.0001454 -0.0006259 0.0000581 -0.0269668 0.2166954 0.0739952 0.000155 -0.1306172 0.037293 0.0001878 0.0001854 0.000225 -0.1086636 -0.2310921 0.067249 0.0000808 0.0501746 0.1431319 0.0005287 0.0000461 0.0005377 -0.1685219 0.0604255 -0.0888138 -0.0001182 0.1426908 0.0349937 0.0003401 -0.000137 0.0002541 -0.1496677 1.996104 0.0060648 0.0009226 0.2816445 0.8105604 0.0001798 0.001273 0.0003981 0.1062228 -0.24048 0.1340046 -0.0000949 0.3478375 -0.1942739 -0.0001483 0.0008687 -0.0006866 0.1495315 -0.0290841 0.0949351 0.000156 -0.0650859 0.1050513 0.0003787 -0.0000979 0.0004081 -0.1563881 -0.1870295 0.0838716 0.0001102 0.1542347 0.1023386 0.0004559 0.00023 0.0004254 -0.1727124 -0.0268427 -0.1510318 -0.0002155 -0.1106521 0.030154 0.0002754 -0.0001285 0.0002676 -0.1617751 0.0964777 0.0876335 0.0001642 0.0179378 0.0332549 0.0002732 0.0000491 0.0002871 -0.1482465 -0.0387571 -0.0476428 -0.0002126 -0.0291396 0.0726649 0.0000078 -0.0004045 0.00013 0.0607869 0.1218616 -0.0087932 -0.0000333 -0.0124516 -0.0065639 -0.0002617 -0.0001182 -0.0002316 0.1455645 0.0479314 -0.0756932 -0.0001468 -0.0293755 -0.094845 -0.000416 -0.0000407 -0.0004384 0.1535708 0.0015865 0.11327 0.0001794 0.1187437 0.014797 -0.0001532 0.000222 -0.0001482 0.142674 0.0110884 -0.0310365 -0.0639636 -0.0613034 0.016702 -0.0899261 -0.074573 -0.1050779 -0.029262 0.0106768 -0.0317825 0.0639954 -0.0621357 0.0158697 0.0900223 0.0742554 0.1053001 -0.0279976 0.0688015 -0.0774262 -0.0001306 -0.0048669 -0.0759521 -0.0003557 -0.0000254 -0.0003716 0.1558506 0.0613574 -0.0059719 -0.000026 -0.0836523 -0.0989108 -0.0004108 -0.0001399 -0.0003907 0.157205 -0.0393756 0.1073486 0.0001268 0.1178754 -0.0134958 -0.0002457 0.0001475 -0.0002471 0.162305 -0.1270498 -0.0551131 -0.0001312 -0.0568907 0.0769245 -0.0001352 -0.0001298 -0.000132 0.1597699 0.0816943 -0.00675 0.0039555 -0.0744599 0.0283563 0.1088565 0.0405925 0.0972854 -0.0616894 -0.1142436 0.1045941 -0.000143 0.1791911 -0.0475917 -0.0000213 -0.000079 -0.0001287 0.1022762 0.0815344 -0.0063727 -0.0034854 -0.0738115 0.02908 -0.1088195 -0.0403757 -0.0970587 -0.0628495 unknown
polarizability: 242.896637|-5.1471771|144.0479503|0.051063|0.1125944|64.695264 unknown
InChI: InChI=1S/C13H12O/c1-2-13(14)12-8-7-10-5-3-4-6-11(10)9-12/h3-9H,2H2,1H3
charge 0 multiplicity 1
26 atoms
O  -2.860257 -1.641627 -0.002266
C  1.250915 -0.561312 -0.000855
C  1.612036 0.844398 0.00137
C  -1.143284 0.051652 -0.000472
C  -0.130591 -0.921399 -0.001702
C  0.563927 1.824388 0.002702
C  -0.776327 1.443599 0.001777
C  -2.577823 -0.406632 -0.001749
C  -3.686033 0.652436 -0.002121
C  2.293442 -1.548629 -0.002179
C  2.998813 1.205045 0.00215
C  3.636317 -1.166928 -0.001373
C  3.990993 0.220978 0.000795
C  -5.100854 0.049844 -0.005995
H  -0.429151 -1.976568 -0.003354
H  0.834808 2.886989 0.004494
H  -1.554568 2.213324 0.002833
H  -3.543329 1.306496 0.883096
H  -3.539926 1.310323 -0.883791
H  2.016859 -2.609539 -0.003855
H  3.272306 2.266987 0.003817
H  4.425311 -1.926696 -0.002403
H  5.048475 0.50777 0.001386
H  -5.258097 -0.589637 0.879236
H  -5.863703 0.8491 -0.005841
H  -5.25486 -0.58606 -0.8944
