program: Gaussian 09
title: 000080511
version: EM64L-G09RevD.01
frameworkgroup: C1[X(C4H12N2)]
method: RPBEPBE
basis: SDD
operation: Freq
keyword: #pfreq=noraman
keyword: PBEPBE/SDD
title: #p freq=noraman PBEPBE/SDD
converged: YES YES NO NO
title: Mulliken charges:
elementType: N N C C C C H H H H H H H H H H H H
charge: -0.295508 -0.570837 -0.371790 -0.343291 -0.367348 -0.624908 0.243812 0.168603 0.204459 0.168273 0.172721 0.205132 0.248937 0.220650 0.225019 0.186823 0.257938 0.271315
chargesum: 0.00000
title: Mulliken charges with hydrogens summed into heavy atoms:
elementType: N N C C C C
charge: -0.046571 -0.041584 0.040626 0.029442 0.010504 0.007584
polarizability: 7.38062610e+01 -3.21078588e-01 5.43867534e+01 -7.51774352e-01 -1.54297479e+00 4.79966004e+01
1716.lowfreq: -39.6767 -12.9933 0.0008 0.0009 0.0010 3.2339 70.2147 78.7289 130.3336
frequency: 70.1611 78.6877 130.2971 139.7408 226.8108 230.8331 312.5017 365.7949 477.8317 594.9027 651.6158 769.4735 868.6544 940.9494 972.4021 1048.1952 1081.7702 1083.5985 1111.4923 1123.6450 1164.0551 1205.9076 1223.6577 1267.3601 1282.6205 1301.8117 1367.9627 1388.0584 1434.5945 1448.1948 1464.8483 1467.4258 1486.1278 1493.2353 1499.7371 1637.3211 2826.8601 2859.9612 2863.0987 2949.0083 2988.5524 3009.3857 3010.8569 3064.7597 3072.4440 3445.7078 3451.9603 3579.9207
redmass: 2.3654 1.8916 2.6970 2.4557 1.1046 1.2022 2.6130 4.0701 2.6261 1.2818 1.3188 1.0798 1.1869 2.4838 1.6126 3.2391 1.8268 1.3331 2.0072 1.7228 3.6320 1.5686 1.4993 1.1499 1.1204 1.3249 1.3791 1.5112 1.1509 1.1952 1.0773 1.0733 1.0675 1.0713 1.0780 1.0939 1.0716 1.0694 1.0593 1.0688 1.0851 1.0741 1.0856 1.0955 1.0992 1.0745 1.0448 1.0975
irintensity: 0.3658 0.6969 1.5731 2.9443 36.9567 16.5343 14.3963 3.2244 38.0038 185.4895 153.8650 5.6045 0.5298 3.9219 2.1191 10.9795 6.7849 6.7766 27.8533 1.5863 24.1609 1.3734 0.6127 4.5272 2.4177 1.9067 4.0549 21.5074 2.2870 15.9576 7.7381 5.7795 16.1198 1.1498 5.2061 39.3809 75.8283 58.7366 274.3345 22.7802 37.8120 49.8075 58.7700 50.3941 40.9072 1.8160 1.8003 0.1034
temp: 298.150 k
press: 1.00000 atm
elementType: 7 7 6 6 6 6 1 1 1 1 1 1 1 1 1 1 1 1
symmnumber: 1
zpe: 427873.1 jmol-1
zpe.correction: 0.162968 hartree
zpe.thermalcorrener: 0.171541 hartree
zpe.thermalcorrenthalpy: 0.172486 hartree
zpe.thermalcorrgfe: 0.130023 hartree
zpe.sumelectzpe: -268.567481 hartree
zpe.sumelectthermal: -268.558907 hartree
zpe.sumelectthermalent: -268.557963 hartree
zpe.sumelectthermalfe: -268.600425 hartree
dipole: 0.2735 0.7794 2.1813
dipole: 2.3325
quadrupole: -34.7617 -38.5869 -40.9477
quadrupole: 1.6256 1.9346 -3.9661
quadrupole: 3.3371 -0.4881 -2.8489 1.6256 1.9346 -3.9661
hfenergy: -268.7304488 hartree
pointgroup: C01 [X(C4H12N2)]
dipole: 0.1027464 0.4262554 0.8061371 debye
dipolederiv: -0.7275048 0.0213997 0.0150916 0.0148631 -0.4942329 -0.2167467 -0.0106827 -0.2719818 -0.3312404 -0.6259809 0.1637162 0.0209608 0.1774674 -0.4737235 -0.2524403 0.0503518 -0.2534136 -0.4931468 -0.1328446 -0.0167775 -0.0063477 -0.051968 0.0595639 -0.0378899 -0.0005671 -0.0906345 0.1656621 0.376543 0.177745 0.0256374 0.2077053 0.3466364 0.1133448 -0.0598189 0.1043357 0.3704168 0.5116946 -0.2096743 -0.0468169 -0.1210864 0.3263647 0.1180321 0.0279119 0.0876594 0.3504105 0.4093723 -0.1568932 -0.0473944 -0.2374817 0.2928441 0.1033909 0.0575216 0.1009069 0.2890662 0.0739847 0.0000076 0.0021799 0.0053421 -0.0222566 -0.1049288 0.0055014 -0.1053102 -0.0497407 0.0333646 -0.0014217 0.0031201 0.0064106 -0.0497822 0.1279052 -0.007635 0.1600166 -0.113089 0.035203 0.0033005 -0.0236059 -0.0225643 -0.0518033 0.1046458 -0.0084206 0.132209 -0.1004391 -0.0550303 -0.0183079 0.0061364 -0.0891568 -0.1451722 -0.1535074 -0.0494155 -0.2074506 -0.1577283 -0.0672959 0.0826645 0.0432878 0.0708923 -0.1470483 -0.1541838 0.0572037 -0.2079636 -0.1434597 0.031277 0.0190332 0.0034721 0.0210628 -0.04303 0.1079203 0.0118601 0.140823 -0.0967475 0.0970693 0.0218073 -0.0368655 -0.0151672 0.1812363 0.1087019 -0.0345756 0.2326307 0.0697458 -0.1282376 -0.1000136 0.0017869 -0.1552994 -0.0337031 0.0033002 0.0262202 -0.0103762 0.1093779 0.0695727 0.0098334 0.0168871 0.0909847 -0.0010697 0.1141894 -0.0461445 0.1233437 -0.112949 -0.0605183 0.0413357 0.0097782 0.1848853 -0.1046326 -0.1729366 0.1150262 -0.1877858 -0.1471918 0.1654813 0.0205819 0.0241729 0.0387452 0.2262675 0.1162857 -0.020729 0.1960185 0.075072 -0.00615 -0.0583368 -0.0114806 -0.125635 0.1335415 0.0749172 -0.1136082 0.0569729 0.3159809 unknown
polarizability: 73.8104797|-0.5534485|53.8218005|-0.4625921|-2.3902252|48.5573347 unknown
InChI: InChI=1S/C4H12N2/c1-6-4-2-3-5/h6H,2-5H2,1H3
charge 0 multiplicity 1
18 atoms
N  -1.836486 -0.47447 0.003865
N  3.128267 -0.258745 0.048472
C  0.648591 -0.359574 0.017618
C  -0.671941 0.43403 0.022695
C  1.892603 0.551288 0.044637
C  -3.145288 0.202709 0.0085
H  0.690605 -1.004849 -0.877618
H  0.673443 -1.032811 0.903194
H  -0.721992 1.070572 -0.884286
H  -0.684067 1.13305 0.901103
H  1.807444 1.251558 0.91381
H  1.898258 1.177688 -0.868593
H  -1.765902 -1.188089 0.741633
H  -3.954773 -0.548733 0.026063
H  -3.259142 0.791396 -0.921221
H  -3.302049 0.903309 0.867057
H  3.19901 -0.897635 0.847424
H  3.989921 0.278706 -0.086953
