program: Gaussian 09
title: 000080525
version: EM64L-G09RevD.01
frameworkgroup: C1[X(C9H7NO2S2)]
method: RPBEPBE
basis: SDD
operation: Freq
keyword: #p
keyword: freq=noraman
keyword: PBEPBE/SDD
title: #p freq=noraman PBEPBE/SDD
converged: NO YES NO YES
title: Mulliken charges:
elementType: S S O O N C C C C C C C C C H H H H H H H
charge: 0.293501 0.326245 -0.409870 -0.215119 0.024920 -0.352685 0.371095 -0.513325 -0.271881 -0.335132 -0.238800 -0.209851 -0.689541 0.224555 0.247525 0.255358 0.232547 0.232877 0.319654 0.319608 0.388318
chargesum: 0.00000
title: Mulliken charges with hydrogens summed into heavy atoms:
elementType: S S O O N C C C C C C C C C
charge: 0.293501 0.326245 -0.021552 -0.215119 0.024920 -0.352685 0.371095 -0.513325 -0.024357 -0.079774 -0.006252 0.023026 -0.050279 0.224555
polarizability: 2.34656578e+02 1.29972987e+01 1.50721347e+02 6.20619708e-03 -2.35620103e-03 5.63006857e+01
1716.lowfreq: -4.1247 -0.0034 -0.0028 -0.0020 4.9854 6.7074 27.9423 32.4400 65.9163
frequency: 27.9198 32.4170 65.9117 77.0192 104.1144 169.5412 184.8481 204.4046 287.4017 340.6133 384.6972 398.2102 428.6765 485.9495 499.7092 510.7864 557.3640 581.5192 582.3548 616.8035 631.2945 677.0372 731.9766 745.6834 766.0260 837.8233 862.8768 873.1374 901.8997 917.3389 945.7675 984.7913 1016.9853 1039.8249 1052.3985 1118.7032 1142.0137 1169.2155 1222.6446 1233.0603 1272.9112 1330.0160 1375.4580 1412.8087 1430.9759 1443.5360 1468.2852 1568.8170 1601.4059 1670.0939 3051.8386 3117.6363 3137.6366 3151.1769 3164.9936 3175.7580 3517.9854
redmass: 9.0660 7.4785 7.3613 2.8144 8.2817 9.5038 5.7795 8.7516 6.6367 10.1177 10.6963 11.1879 3.1296 8.9827 1.8072 6.0081 5.8461 4.8951 7.5327 9.0660 1.3616 7.1372 2.6209 6.9320 1.5479 6.9537 1.3859 5.0926 1.7851 10.0017 1.3837 1.3189 2.1964 5.3841 2.2115 1.5467 1.1305 1.1284 2.7712 1.3589 1.5712 2.1952 4.8143 1.0932 2.8621 2.5546 11.7600 6.2916 7.1373 8.9159 1.0585 1.1041 1.0856 1.0903 1.0955 1.1001 1.0641
irintensity: 1.4161 0.0940 1.8582 3.7801 1.0033 2.4859 1.9864 1.7050 0.0120 3.0253 0.7911 14.6138 8.1118 0.2422 28.9276 5.3841 66.6102 1.2594 10.7341 10.8452 143.6130 5.7715 21.4699 29.6595 78.7559 0.3721 1.1875 24.3443 9.7958 142.4261 2.7387 0.0736 6.1873 19.6120 311.8562 5.5335 0.0209 0.1216 4.8381 2.8813 1.3287 65.8661 8.7354 54.4898 45.9464 9.2943 188.5116 0.6245 4.1385 192.5225 11.7608 0.0519 1.5524 7.8309 15.1717 18.2536 35.5165
temp: 298.150 k
press: 1.00000 atm
elementType: 16 16 8 8 7 6 6 6 6 6 6 6 6 6 1 1 1 1 1 1 1
symmnumber: 1
zpe: 372649.3 jmol-1
zpe.correction: 0.141935 hartree
zpe.thermalcorrener: 0.154840 hartree
zpe.thermalcorrenthalpy: 0.155784 hartree
zpe.thermalcorrgfe: 0.099947 hartree
zpe.sumelectzpe: -1347.484743 hartree
zpe.sumelectthermal: -1347.471837 hartree
zpe.sumelectthermalent: -1347.470893 hartree
zpe.sumelectthermalfe: -1347.526730 hartree
dipole: 1.2063 2.3295 0.0017
dipole: 2.6233
quadrupole: -76.9052 -93.5175 -98.3238
quadrupole: -10.4381 -0.0003 0.0093
quadrupole: 12.6770 -3.9353 -8.7416 -10.4381 -0.0003 0.0093
hfenergy: -1347.6266774 hartree
pointgroup: C01 [X(C9H7N1O2S2)]
dipole: 0.4880499 0.9091036 0.0224392 debye
dipolederiv: -0.5235876 0.0675998 -0.0058204 0.0835578 -0.2964506 -0.006498 -0.0054803 -0.0066559 0.1143874 -0.5995044 -0.0093871 -0.0069251 0.0317162 0.0167992 0.00037 -0.0063718 -0.0000047 0.0151957 -0.7232574 0.5018505 0.0050642 0.580007 -1.0437573 -0.0040755 0.0063158 -0.0049811 -0.4282134 -0.8717424 -0.2320333 -0.0102129 0.0858348 -0.8172639 -0.0078705 -0.0046812 -0.0112547 -0.2985237 -0.8742037 -0.2018961 -0.0117132 -0.3956151 -0.8584603 -0.0172934 -0.015216 -0.0151732 -0.1428638 0.1007878 0.2981174 0.0075822 0.4953906 0.1454687 0.0098652 0.0111533 0.0076555 -0.0987041 0.4892793 0.2087883 0.0084247 -0.0671302 0.0085971 -0.0018966 0.0033895 0.0011752 0.0728584 1.4846214 -0.1416139 0.0152192 0.0959198 0.8051668 0.0178758 0.0195985 0.0152472 -0.1295461 0.006565 -0.1152229 -0.0006955 -0.1826886 0.0077615 0.0002991 -0.0019393 0.0010398 -0.118155 0.0025958 -0.0606704 0.0005771 -0.0404261 0.0569805 0.0032961 0.0009534 0.0030978 -0.1482964 -0.0117725 -0.0436585 0.0009449 -0.0631501 0.0162 0.0026134 0.0005387 0.0028205 -0.1665867 -0.0899254 0.0890948 0.0024436 0.129577 0.0655795 0.005593 0.0031716 0.0051425 -0.1632438 -0.2912294 -0.1246107 -0.0069493 -0.5409644 0.1112741 -0.005805 -0.0150428 -0.0010496 0.1099811 1.6120817 -0.2061095 0.0119505 -0.2991161 1.4844338 0.018014 0.0109224 0.019031 0.219342 0.0601317 0.0306771 -0.0006273 0.084999 -0.0322314 -0.0026878 0.0003634 -0.0032793 0.1670817 0.0590587 0.0805842 0.0002498 0.0386323 -0.0248081 -0.003084 -0.0005261 -0.0026464 0.1684107 -0.1306063 0.0067737 -0.0031754 -0.0006057 0.0854095 -0.001477 -0.0032931 -0.0013988 0.1663052 0.0072464 -0.0992872 -0.0035395 -0.1110417 -0.0531138 -0.0051621 -0.0037508 -0.0050297 0.1632219 0.0766345 0.0095954 0.0180913 0.1000143 0.0098369 0.0597515 0.0326206 0.0318062 0.0486711 0.0776538 0.0109022 -0.0169706 0.1024471 0.0132952 -0.0587278 -0.0277736 -0.0330376 0.043973 0.1391729 -0.0694938 -0.0039182 -0.1273581 0.2992827 -0.0031004 -0.0049521 -0.0025047 0.4047046 unknown
polarizability: 235.0008525|11.7123657|150.3201991|2.182639|1.8216384|56.3575595 unknown
InChI: InChI=1S/C9H7NO2S2/c11-8(12)5-13-9-10-6-3-1-2-4-7(6)14-9/h1-4,11H,5H2
charge 0 multiplicity 1
21 atoms
S  0.987532 -2.16776 -0.041117
S  -2.025867 -1.321172 -0.059087
O  -4.813847 1.609729 -0.037793
O  -4.958307 -0.712791 -0.078595
N  0.158136 0.406478 -0.00388
C  2.218962 -0.831136 -0.003401
C  1.56954 0.447509 0.012598
C  -0.295882 -0.826939 -0.0311
C  3.621241 -0.947154 0.010068
C  2.349587 1.626822 0.042639
C  4.385137 0.242559 0.040214
C  3.75444 1.515278 0.056299
C  -2.753192 0.420489 -0.034966
C  -4.264027 0.323467 -0.053564
H  4.114329 -1.923793 -0.002231
H  1.849236 2.599615 0.05478
H  5.478263 0.177089 0.051176
H  4.368803 2.421536 0.079593
H  -2.382972 0.980606 -0.908067
H  -2.402976 0.946615 0.867137
H  -5.807635 1.546853 -0.049002
