program: Gaussian 09
title: 000080510
version: EM64L-G09RevD.01
frameworkgroup: C1[X(C10H13NO2)]
method: RPBEPBE
basis: SDD
operation: Freq
keyword: #p
keyword: freq=noraman
keyword: PBEPBE/SDD
title: #p freq=noraman PBEPBE/SDD
converged: YES YES NO NO
title: Mulliken charges:
elementType: O O N C C C C C C C C C C H H H H H H H H H H H H H
charge: -0.244722 -0.440044 -0.193568 -0.363018 -0.373946 -0.306934 -0.325336 0.472637 -0.354766 -0.348705 -0.386326 -0.365912 0.277656 0.209925 0.218464 0.209347 0.223368 0.216246 0.192928 0.193010 0.219103 0.220835 0.239747 0.214874 0.245915 0.349223
chargesum: 0.00000
title: Mulliken charges with hydrogens summed into heavy atoms:
elementType: O O N C C C C C C C C C C
charge: -0.244722 -0.090822 -0.193568 0.065370 0.058769 0.102241 0.086778 0.472637 -0.133931 -0.108959 -0.171452 -0.119997 0.277656
polarizability: 1.77771958e+02 1.91281481e+00 1.19533651e+02 -1.22152940e+00 -5.30135925e+00 7.00789696e+01
1716.lowfreq: -15.4908 -11.0125 -0.0008 -0.0004 0.0005 3.3250 51.7988 57.5004 107.1259
frequency: 51.7568 57.4785 107.1239 179.7234 229.9900 253.1883 272.1300 310.6163 343.6205 370.7001 387.9571 411.7950 445.2678 459.9646 482.8453 519.4623 585.0423 635.6145 682.2298 708.8156 785.0061 801.7687 806.4429 812.6046 842.6044 902.1820 913.8643 917.1390 935.1090 993.5196 1023.4043 1041.9905 1053.8348 1081.7645 1103.2069 1108.6153 1145.3603 1169.0144 1184.7677 1196.7670 1224.9668 1245.2149 1254.7895 1282.6983 1318.1689 1332.9409 1344.7920 1347.4583 1366.2617 1374.1453 1387.7441 1432.1857 1443.9114 1451.7820 1452.5412 1462.6099 1508.1184 1589.4876 1635.4562 2895.7673 2909.8499 2952.9147 2956.9135 3042.4727 3076.0890 3081.1203 3084.9040 3110.8288 3149.6193 3150.3781 3172.0697 3587.5427
redmass: 5.0649 3.2563 4.7559 4.9855 2.0316 2.9194 5.8179 1.1226 3.9919 4.1458 2.1579 2.9735 3.4991 2.7590 5.7531 2.3871 2.5796 6.8763 3.0399 3.6899 1.5195 5.1599 3.2805 1.6326 1.6336 1.8010 2.6055 2.0929 1.3773 2.7530 2.2732 2.2807 1.9832 4.3061 2.1725 1.5072 1.3619 3.1944 1.1178 1.0941 1.4773 2.3871 1.3176 1.2094 1.3781 1.3061 1.7605 1.4882 1.4750 1.3107 3.7064 3.3574 1.0873 1.0933 1.0945 1.1065 2.7144 6.3178 6.5092 1.0693 1.0711 1.0667 1.0667 1.0908 1.0903 1.0960 1.0972 1.0888 1.0928 1.0883 1.0963 1.0660
irintensity: 0.8341 1.2199 1.2062 2.4321 8.5312 18.7562 0.6896 143.0802 2.9587 9.1131 0.3084 1.9583 11.8286 2.1711 6.1310 32.5568 3.0686 0.8256 24.1923 1.6158 15.7924 47.5248 6.7502 58.6340 4.5345 15.2874 46.4567 11.6228 2.8252 4.5739 10.6725 4.9547 18.1016 46.0846 7.1979 47.6705 198.5067 15.9048 0.9765 4.5264 158.1290 24.8532 43.6391 4.4244 8.9320 3.3655 5.4902 13.5048 13.0992 1.8097 46.4789 12.1377 2.7007 16.6662 16.3537 34.4700 278.9441 0.9746 3.0644 63.6249 82.9950 27.9752 114.7535 29.3532 22.0868 41.0387 37.9123 24.1514 16.6178 15.6792 6.8717 38.1850
temp: 298.150 k
press: 1.00000 atm
elementType: 8 8 7 6 6 6 6 6 6 6 6 6 6 1 1 1 1 1 1 1 1 1 1 1 1 1
symmnumber: 1
zpe: 561886.2 jmol-1
zpe.correction: 0.214011 hartree
zpe.thermalcorrener: 0.225529 hartree
zpe.thermalcorrenthalpy: 0.226473 hartree
zpe.thermalcorrgfe: 0.176375 hartree
zpe.sumelectzpe: -593.048733 hartree
zpe.sumelectthermal: -593.037216 hartree
zpe.sumelectthermalent: -593.036272 hartree
zpe.sumelectthermalfe: -593.086369 hartree
dipole: 0.1414 1.6316 -0.5381
dipole: 1.7238
quadrupole: -86.0667 -65.7229 -80.4698
quadrupole: 8.2875 0.4971 -0.6657
quadrupole: -8.6469 11.6969 -3.0500 8.2875 0.4971 -0.6657
hfenergy: -593.2627446 hartree
pointgroup: C01[X(C10H13N1O2)]
dipole: -0.0553819 0.6489377 0.1891174 debye
dipolederiv: -0.6014901 -0.0103739 -0.0578821 -0.0244183 -0.7438856 0.1097864 -0.0621457 0.098014 -0.4454225 -1.6565817 0.0314856 0.0166803 0.0081893 -0.0588466 0.0613094 -0.0048608 0.0669538 -0.4137105 -1.6443276 0.0088252 0.0395474 -0.1513332 -0.4161429 -0.0132411 -0.3841156 0.0205337 -0.3845078 0.22153 0.1999676 -0.1582944 0.4541845 0.2338711 -0.0858706 -0.1123716 -0.0944364 0.4089059 0.1362835 -0.2203041 -0.0153748 -0.4582374 0.3669792 0.0965985 -0.0604427 0.1287553 0.2958409 0.3751792 -0.1650923 0.0633488 -0.0765419 0.548779 -0.0059341 0.1026355 0.0599377 0.3361381 0.3864081 0.168019 -0.0446833 0.1463887 0.4821854 -0.0843697 0.0529062 -0.1584579 0.4364798 1.5548979 0.0055097 -0.0036672 -0.0038669 -0.2107148 0.0438219 0.0927884 0.0077537 0.0459017 -0.24517 -0.1588887 -0.0126427 0.3469255 0.0738729 0.043236 -0.0127654 0.0570573 -0.1656841 -0.2134652 0.1595797 0.028236 -0.3406272 0.0627347 0.0494509 0.0286186 0.050265 -0.1964511 -0.1426087 0.1497178 0.0276666 -0.2485518 0.0900985 0.0552437 -0.039004 0.0547663 -0.1832727 -0.1324547 -0.1442673 -0.0151905 0.2620722 0.107176 0.0414064 0.0610783 0.0458303 -0.1498865 1.418033 -0.0469833 -0.013735 -0.0643403 -0.1164268 -0.0246098 -0.0080758 -0.0445545 0.0295739 0.0497151 0.1225735 -0.001318 0.0705869 -0.0827519 0.0041981 0.0141305 -0.0237791 0.0701043 -0.0353574 -0.0575084 0.0154078 -0.096991 0.0288179 -0.0832743 0.1582276 0.0467088 -0.2252282 -0.0202726 0.0276414 -0.0276225 0.1341368 -0.0436029 -0.0496896 0.063466 -0.1632502 -0.1751146 0.048476 -0.1140467 0.0700922 -0.031215 -0.0453854 0.072336 0.0578901 0.0667083 0.010409 -0.0389536 -0.0795203 0.049657 -0.0681663 -0.0624593 0.0711938 0.0867654 0.1141501 0.0279713 0.0464612 0.0723033 0.0030815 0.044265 -0.0151886 -0.0245703 -0.0483074 -0.1403447 -0.181707 0.0429709 -0.0556107 0.0396502 -0.0622196 0.0143067 -0.0942013 -0.0211133 0.0296558 -0.2121382 -0.0471757 0.0895294 -0.0005216 0.1037715 -0.1188773 0.0174142 0.0426337 -0.0253698 0.0864278 0.0301352 -0.0999694 -0.024877 -0.0998397 -0.0411609 -0.0365432 -0.0395816 -0.039718 0.1409901 0.0494714 0.0964184 0.0194751 0.1021314 -0.0348022 -0.0345105 0.0210677 -0.0405422 0.1455768 -0.0279779 0.1099868 0.0200312 0.1103827 -0.0493589 -0.0403725 0.0306015 -0.0341228 0.1623296 0.0376715 -0.073559 -0.0134597 -0.0854896 -0.0201542 -0.0334592 -0.0267617 -0.0268537 0.1631131 0.4086023 -0.0154336 -0.0036056 0.0288037 0.0509369 -0.055349 0.0067361 -0.0556609 0.373361 unknown
polarizability: 177.7652322|-1.9065164|119.8433437|-1.5238475|3.5515003|69.7760025 unknown
InChI: InChI=1S/C10H13NO2/c12-10-3-1-9(2-4-10)11-5-7-13-8-6-11/h1-4,12H,5-8H2
charge 0 multiplicity 1
26 atoms
O  3.983964 -0.026974 -0.180697
O  -4.599275 -0.075665 0.021444
N  1.097067 0.034244 0.110218
C  1.824996 1.114773 -0.603439
C  1.82423 -1.251154 0.063979
C  3.256203 1.246927 -0.060268
C  3.265015 -1.064329 0.574011
C  -0.328309 0.017052 0.05182
C  -1.073904 1.21371 0.258696
C  -1.063526 -1.18647 -0.164129
C  -2.48258 1.210827 0.245395
C  -2.473044 -1.195886 -0.160647
C  -3.189509 0.002075 0.038842
H  1.298693 2.074775 -0.476852
H  1.870992 0.894621 -1.695718
H  1.847576 -1.6730 -0.96928
H  1.318212 -1.981145 0.721391
H  3.836445 1.975851 -0.649641
H  3.227531 1.562447 1.005429
H  3.241986 -0.791702 1.651534
H  3.849652 -1.989189 0.438359
H  -0.555283 2.155891 0.463035
H  -0.541562 -2.128542 -0.354441
H  -3.025238 2.150794 0.413362
H  -3.028172 -2.124005 -0.327396
H  -4.99786 0.816674 0.172095
