program: Gaussian 09
title: 000000448
version: EM64L-G09RevD.01
frameworkgroup: C1[X(C9H8ClNO3)]
method: RPBEPBE
basis: SDD
operation: Freq
keyword: #p
keyword: freq=noraman
keyword: PBEPBE/SDD
title: #p freq=noraman PBEPBE/SDD
converged: YES YES NO NO
title: Mulliken charges:
elementType: Cl O O O N C C C C C C C C C H H H H H H H H
charge: -0.051040 -0.279871 -0.453107 -0.211245 -0.420505 0.286211 0.197579 -0.386473 -0.320154 -0.357691 -0.092526 -0.219688 -0.218518 0.181973 0.284314 0.284116 0.362860 0.301683 0.217974 0.236336 0.261589 0.396182
chargesum: 0.00000
title: Mulliken charges with hydrogens summed into heavy atoms:
elementType: Cl O O O N C C C C C C C C C
charge: -0.051040 -0.279871 -0.056925 -0.211245 -0.057645 0.286211 0.197579 0.181957 -0.018472 -0.139716 -0.092526 0.016648 0.043071 0.181973
polarizability: 1.86845743e+02 1.49069872e+00 1.28327253e+02 4.11211902e+00 8.07406664e-01 5.37275362e+01
1716.lowfreq: -5.3964 -1.1389 -0.0014 -0.0013 -0.0004 2.7011 16.1257 36.0014 54.2113
frequency: 16.0260 35.9178 54.2040 70.0282 113.2087 156.2357 178.8602 209.0359 245.3917 272.2418 337.7035 389.3168 425.4767 439.5685 488.0971 502.2517 539.7842 554.6457 578.9412 644.7960 650.8280 675.2291 705.9295 725.8702 796.7325 809.4399 886.2824 902.5357 936.4179 975.7313 978.5387 984.6945 1070.5902 1077.5835 1081.6165 1093.8955 1162.0210 1185.4091 1212.0226 1248.2369 1285.1163 1305.9766 1334.6946 1381.6033 1410.5505 1453.8673 1459.1591 1495.1444 1562.8071 1596.7978 1604.0774 1687.8586 2989.8606 3027.8986 3131.6880 3154.1312 3170.6184 3176.5333 3530.7788 3566.7965
redmass: 7.6499 7.1510 6.7806 7.1941 3.3846 10.4110 4.9244 3.7927 7.8219 7.1616 7.2148 10.1363 3.9139 4.8793 2.0523 4.2441 4.3660 4.2903 1.2247 6.9787 1.4493 3.0825 7.5692 2.6128 1.7333 5.5868 5.6294 1.4003 1.4376 1.4133 1.9429 5.7767 3.2515 1.8778 2.8845 1.6180 3.1204 1.1345 1.0820 1.6751 1.3971 2.3180 1.6783 9.5979 2.7827 1.7920 1.2134 2.2764 7.1486 7.9111 6.5693 9.2300 1.0610 1.0983 1.0877 1.0926 1.0927 1.0981 1.0645 1.0779
irintensity: 0.2099 6.3312 1.2339 1.2162 0.2924 2.1868 0.5170 3.0684 7.3097 0.2577 4.9936 8.6229 2.4342 10.5464 60.1378 5.9928 45.2713 18.2200 31.9792 4.2427 178.1167 11.2898 42.6470 80.4443 26.9686 19.1264 49.1546 0.7531 15.4707 0.0321 1.0717 1.5216 14.2570 191.2874 27.4575 23.5481 7.6070 0.8077 0.0233 70.8658 3.8939 51.8911 34.0286 0.2582 7.2221 109.6468 59.8608 412.2075 134.4179 49.5409 4.9290 277.7065 25.3099 4.1418 9.5884 11.1021 3.1277 8.3365 34.7466 54.9470
temp: 298.150 k
press: 1.00000 atm
elementType: 17 8 8 8 7 6 6 6 6 6 6 6 6 6 1 1 1 1 1 1 1 1
symmnumber: 1
zpe: 411140.3 jmol-1
zpe.correction: 0.156595 hartree
zpe.thermalcorrener: 0.169807 hartree
zpe.thermalcorrenthalpy: 0.170751 hartree
zpe.thermalcorrgfe: 0.113805 hartree
zpe.sumelectzpe: -1087.248817 hartree
zpe.sumelectthermal: -1087.235605 hartree
zpe.sumelectthermalent: -1087.234661 hartree
zpe.sumelectthermalfe: -1087.291607 hartree
dipole: 1.3757 5.4964 -0.4908
dipole: 5.6872
quadrupole: -95.3397 -83.6050 -89.1702
quadrupole: 5.3607 -1.9027 1.1414
quadrupole: -5.9680 5.7666 0.2014 5.3607 -1.9027 1.1414
hfenergy: -1087.4054122 hartree
pointgroup: C01 [X(C9H8Cl1N1O3)]
dipole: -0.2075324 1.4132529 1.7222199 debye
dipolederiv: -0.6245426 0.2649929 0.1862611 0.3173402 -0.2660369 -0.1444089 0.2220636 -0.1454032 -0.1759394 -0.7835865 -0.1043389 -0.1053478 0.022581 -0.5543946 -0.2802998 0.0925126 -0.2469091 -0.7268826 -0.5123161 -0.1256784 -0.1893628 -0.1803193 -0.6377338 -0.314266 -0.2552175 -0.3107541 -0.8851689 -1.2055241 -0.099362 -0.1211325 0.0336373 -0.3926705 -0.1137256 0.0892698 -0.1057372 -0.4835657 -1.2876133 0.127788 0.2379021 0.2207555 -0.4970127 -0.086171 0.3732562 -0.0612164 -0.5199565 -0.3162478 -0.0604909 -0.0662514 -0.1472449 0.0261681 -0.0079175 -0.1836165 0.0001459 -0.0277318 1.7737276 0.0166371 -0.0934525 -0.0996074 0.5330898 0.4655544 -0.2805614 0.4021464 0.8379503 0.471143 0.0855461 0.1124701 0.2561245 0.1774761 -0.1811347 0.323628 -0.1658763 0.029634 -0.3197041 0.149731 0.1145854 0.0480103 -0.0993628 -0.0195702 -0.007245 0.0007645 -0.0729322 -0.0460904 -0.0609527 -0.0215427 -0.0282165 -0.0948507 0.0435156 0.0596024 0.0467407 -0.1204529 0.9326777 -0.4822928 -0.3370306 -0.5396039 0.299453 0.2659343 -0.3748197 0.2663649 0.140302 -0.0417187 -0.0180606 -0.0073335 0.0519855 0.0269671 0.1345824 0.0543233 0.1309648 -0.025204 -0.149496 0.1130768 0.0969999 0.1080433 -0.1532388 -0.0302548 0.0876774 -0.0314794 -0.1250322 1.5822381 0.1217485 0.1368026 0.0316175 0.5893741 0.5629049 -0.0125307 0.5487593 1.0386921 -0.0302965 0.0025592 0.0304542 -0.0977524 -0.0129515 0.0258759 -0.0312281 0.0169174 0.1162453 -0.0374483 0.0232829 0.0072482 -0.0046494 0.0904643 0.0535217 -0.0955064 0.0517694 0.0157307 0.327603 -0.0366826 -0.0517824 -0.0694723 0.2772484 -0.0617904 -0.114907 -0.0700163 0.226607 0.1769083 -0.0156636 -0.0144416 0.0011011 0.0991315 -0.0500384 0.0234823 -0.0593788 0.1168415 -0.0454142 0.0922694 0.0582018 0.1026632 0.0764933 -0.0532508 0.0506707 -0.058764 0.1079207 0.0593272 -0.0091897 -0.0159427 -0.0237648 0.0047644 -0.1282786 -0.0306569 -0.1270398 0.0528196 -0.0277188 -0.0301701 -0.0408836 -0.024089 0.124733 -0.0365452 -0.03276 -0.0381748 0.1330215 0.1040924 0.0452504 0.0835786 0.0208606 0.3828892 -0.0442373 0.0425627 -0.0438239 0.3471016 unknown
polarizability: 185.1326374|-9.0899147|92.4012625|-5.3073628|38.2354115|91.3666324 unknown
InChI: InChI=1S/C9H8ClNO3/c10-7-3-1-2-6(4-7)9(14)11-5-8(12)13/h1-4,11-12H,5H2
charge 0 multiplicity 1
22 atoms
Cl 4.761947 -1.188554 -1.115057
O  -0.581298 -1.086463 -1.79494
O  -3.398884 1.113994 1.46375
O  -5.167778 0.230239 0.236565
N  -1.511153 0.152832 -0.079488
C  0.943261 0.105644 -0.314701
C  -0.424177 -0.320241 -0.790443
C  -2.86432 -0.206732 -0.499097
C  2.046534 -0.61119 -0.843891
C  1.170181 1.17257 0.593544
C  3.344373 -0.260923 -0.441281
C  2.486777 1.50759 0.978372
C  3.591033 0.788296 0.467202
C  -3.941287 0.37495 0.396643
H  -2.993307 -1.307239 -0.52471
H  -3.059035 0.128353 -1.536513
H  -1.414674 0.69955 0.77689
H  1.854026 -1.415614 -1.559898
H  0.340184 1.771209 0.985606
H  2.661521 2.335264 1.673495
H  4.613791 1.040936 0.761068
H  -4.131116 1.473929 2.032384
