program: Gaussian 09
title: 000080476
version: EM64L-G09RevD.01
frameworkgroup: C1[X(C9H12O2)]
method: RPBEPBE
basis: SDD
operation: Freq
keyword: #pfreq=noraman
keyword: PBEPBE/SDD
title: #p freq=noraman PBEPBE/SDD
converged: YES YES NO NO
title: Mulliken charges:
elementType: O O C C C C C C C C C H H H H H H H H H H H H
charge: -0.335234 -0.436120 -0.396851 -0.238874 0.260559 -0.675336 0.117029 -0.322122 -0.322135 -0.252400 -0.217326 0.218174 0.217848 0.205510 0.205288 0.211462 0.228932 0.211751 0.244192 0.249313 0.223181 0.226411 0.376747
chargesum: 0.00000
title: Mulliken charges with hydrogens summed into heavy atoms:
elementType: O O C C C C C C C C C
charge: -0.335234 -0.059373 0.039172 0.171924 0.260559 -0.023192 0.117029 -0.077930 -0.072822 -0.029219 0.009086
polarizability: 1.42897623e+02 5.07085840e+00 1.10151576e+02 -2.81948267e-01 6.32934109e-02 5.67188458e+01
1716.lowfreq: -0.0003 0.0007 0.0007 9.0541 11.9729 19.0693 48.7314 86.3208 94.1907
frequency: 48.6498 86.2090 94.1574 132.3105 187.1341 220.7773 234.2498 279.8339 286.0401 387.0736 443.4481 493.1748 495.3001 543.0591 554.1916 587.7750 708.9642 742.8981 761.0975 772.1138 818.3446 833.7517 896.9306 904.0564 910.3127 959.1763 988.2039 1029.4533 1053.6756 1097.3825 1135.0263 1144.4441 1165.4587 1182.1195 1189.7076 1231.9778 1252.9076 1286.4478 1304.0906 1318.7720 1382.3553 1397.5345 1410.2115 1455.0851 1474.4499 1480.5737 1480.8687 1488.2713 1497.6953 1602.6074 1621.4015 2952.5291 2981.1519 3002.7823 3009.5540 3053.6880 3081.9242 3086.4705 3135.3556 3149.8576 3163.6851 3175.8368 3510.1451
redmass: 4.2513 1.6065 3.7768 2.5635 4.0265 1.2222 3.8810 4.1011 4.9883 3.6488 2.9933 5.6192 1.1191 5.4030 3.8884 7.4278 4.3650 1.2232 6.2178 1.0840 5.9579 1.3825 1.1610 1.7145 1.3352 1.2878 7.0185 2.0363 2.7838 2.0473 2.2132 1.4441 1.1264 1.6764 1.9906 1.2614 2.5090 1.1026 1.3873 1.4859 1.4201 1.2197 4.6383 2.4238 1.1146 1.1907 1.0411 1.4302 1.5102 7.1405 6.3168 1.0553 1.0363 1.0599 1.1062 1.1021 1.1027 1.0989 1.0850 1.0900 1.0947 1.0996 1.0644
irintensity: 0.2208 0.0247 0.0344 4.0347 0.9339 0.0172 1.6311 2.4789 0.7234 8.4302 12.7728 6.4058 132.1490 2.6087 2.7212 3.5001 0.5820 116.1381 30.6583 1.5288 6.0129 0.6808 0.3167 10.4563 5.4959 0.0727 86.1300 33.7175 5.8117 53.9782 3.2904 0.2366 18.0880 83.1718 180.5569 0.3054 134.7610 0.0021 10.0486 23.1989 12.1668 15.3073 26.6445 16.9664 27.6326 21.6693 13.9395 108.9993 21.8339 25.1146 10.2065 31.3631 35.2953 25.7702 24.5711 1.7094 82.8554 39.9046 0.5241 20.3864 21.6807 9.6269 69.4624
temp: 298.150 k
press: 1.00000 atm
elementType: 8 8 6 6 6 6 6 6 6 6 6 1 1 1 1 1 1 1 1 1 1 1 1
symmnumber: 1
zpe: 498572.0 jmol-1
zpe.correction: 0.189896 hartree
zpe.thermalcorrener: 0.200922 hartree
zpe.thermalcorrenthalpy: 0.201866 hartree
zpe.thermalcorrgfe: 0.152767 hartree
zpe.sumelectzpe: -499.756317 hartree
zpe.sumelectthermal: -499.745291 hartree
zpe.sumelectthermalent: -499.744347 hartree
zpe.sumelectthermalfe: -499.793446 hartree
dipole: 3.0056 -1.9726 0.0048
dipole: 3.5951
quadrupole: -57.7753 -65.6813 -69.3363
quadrupole: 3.0367 -0.0454 0.0232
quadrupole: 6.4890 -1.4170 -5.0720 3.0367 -0.0454 0.0232
hfenergy: -499.9462128 hartree
pointgroup: C01 [X(C9H12O2)]
dipole: 1.1378813 0.8251154 0.1580177 debye
dipolederiv: -1.9386084 -0.0245407 -0.0525952 -0.0080474 -0.3613956 -0.0119038 -0.0538981 -0.0110423 -0.2847913 -0.3189969 0.397715 0.06575 0.3795753 -1.185261 -0.1097367 0.0630218 -0.1098864 -0.4211746 -0.039405 -0.0167777 -0.0061229 -0.0620055 0.0779927 -0.0124242 -0.0117699 -0.0107078 0.1419168 0.9649118 0.1518606 0.0384793 0.4725113 0.3110344 0.0008709 0.0886935 -0.01034 0.4043764 1.3642792 -0.248414 0.0030441 -0.2327436 -0.1701678 -0.0391238 0.0097596 -0.0421 0.0376901 -0.0556621 -0.0314582 -0.0077861 0.0457267 0.0430649 -0.0060521 0.0033178 -0.0079589 0.0988422 -0.0883902 -0.328253 -0.0554617 -0.4981171 1.071285 0.1439998 -0.08252 0.1506772 0.0710967 -0.0943711 -0.0392922 -0.0026051 0.137216 -0.0107125 0.0303663 0.0241324 0.0257613 -0.1732523 0.030647 0.2373176 0.0447676 -0.0513042 -0.0712894 0.0152744 -0.0008497 0.024511 -0.1726651 -0.0919842 0.0411096 0.0103564 -0.0759025 0.0123217 0.0306451 -0.008361 0.0344769 -0.1922214 0.0425599 -0.0803058 -0.0047422 0.1219606 0.0202097 0.0348731 0.0266795 0.0280996 -0.1720744 0.051176 -0.0247677 0.0085494 0.015711 -0.0517066 0.1110008 0.003011 0.1282894 -0.0316471 0.0530651 -0.0184388 -0.01055 0.0187294 0.014242 -0.096467 0.0053972 -0.1152052 -0.0972592 -0.02887 0.0184585 0.0361155 -0.0913749 -0.0187508 -0.0881425 -0.0124272 -0.1005825 -0.1180956 -0.0267033 0.0222414 -0.0271153 -0.0968356 -0.0804453 0.0942246 -0.0129166 0.1133336 -0.0583718 0.0907966 0.0036216 0.0369117 -0.0421402 0.0175297 -0.1055881 -0.014445 -0.1190729 -0.1153832 -0.1675398 0.0817816 0.00544 0.1090205 0.0306276 -0.0083876 0.0098425 -0.0089465 0.1059064 0.0911653 0.0074089 -0.0283485 -0.0496924 -0.0505921 0.1216736 0.0085145 0.1375652 -0.0478801 -0.0067289 -0.1054177 -0.0227658 -0.1151277 0.015079 -0.027443 -0.0245075 -0.0274663 0.1599428 0.0208812 -0.0776481 -0.0173866 -0.086754 -0.0001284 -0.0301901 -0.0191213 -0.0297626 0.1667218 0.0524291 0.0522594 0.0042884 0.0719917 -0.1018628 -0.0404946 0.0074207 -0.0410393 0.1635321 -0.1254888 0.049598 -0.0022149 0.0468893 0.0807986 -0.0119049 -0.002685 -0.0116654 0.164784 0.2208375 -0.0680583 -0.0160081 -0.0092866 0.408127 0.00493 -0.0062892 0.0030618 0.3700068 unknown
polarizability: 143.2723846|-3.6232982|108.4528684|2.1354347|8.0118258|58.0427914 unknown
InChI: InChI=1S/C9H12O2/c1-2-7-11-9-6-4-3-5-8(9)10/h3-6,10H,2,7H2,1H3
charge 0 multiplicity 1
23 atoms
O  0.950951 -0.534111 0.05152
O  -0.924595 -2.404893 -0.308159
C  3.364162 -0.324007 0.143575
C  2.041304 0.440967 0.227726
C  -0.377764 -0.055567 0.082113
C  4.575076 0.622602 0.298707
C  -1.345001 -1.083941 -0.113045
C  -0.782805 1.278919 0.278644
C  -2.715529 -0.770475 -0.110967
C  -2.166158 1.589389 0.279832
C  -3.124849 0.570619 0.086129
H  3.382037 -1.099283 0.932212
H  3.41262 -0.848791 -0.828952
H  1.930679 0.939518 1.213278
H  1.975118 1.210976 -0.569118
H  4.556332 1.145513 1.273279
H  5.521823 0.057767 0.2395
H  4.590892 1.389722 -0.497932
H  -0.045239 2.073009 0.429832
H  -3.439837 -1.576161 -0.263417
H  -2.485282 2.625671 0.432282
H  -4.192655 0.813137 0.087319
H  0.069321 -2.420381 -0.277559
