program: Gaussian 09
title: 000080479
version: EM64L-G09RevD.01
frameworkgroup: C1[X(C10H9NO)]
method: RPBEPBE
basis: SDD
operation: Freq
keyword: #p
keyword: freq=noraman
keyword: PBEPBE/SDD
title: #p freq=noraman PBEPBE/SDD
converged: YES YES NO NO
title: Mulliken charges:
elementType: O N C C C C C C C C C C H H H H H H H H H
charge: -0.431377 -0.024805 0.266900 0.342107 -0.037351 -0.383307 -0.481844 -0.326988 -0.304409 -0.262769 -0.366862 -0.219448 0.246464 0.199471 0.229447 0.234457 0.264154 0.231835 0.241729 0.235253 0.347343
chargesum: 0.00000
title: Mulliken charges with hydrogens summed into heavy atoms:
elementType: O N C C C C C C C C C C
charge: -0.084034 -0.024805 0.266900 0.342107 -0.037351 -0.136843 -0.052925 -0.092531 -0.040255 -0.030934 -0.125133 0.015805
polarizability: 1.52766803e+02 1.72494020e+01 1.38982242e+02 -6.84521393e+00 3.79034135e+00 5.56076687e+01
1716.lowfreq: -5.5970 -0.0006 -0.0005 -0.0001 12.2353 13.9888 70.0717 100.3399 176.4930
frequency: 69.9560 100.3353 176.4899 178.7175 244.7315 298.6935 326.0326 429.6948 438.7485 468.6061 489.7694 513.1030 549.4743 608.4201 656.9794 699.3777 773.3621 795.2627 807.7713 839.4120 864.2216 881.2173 931.4449 957.5857 964.5661 970.2740 998.4751 1018.5760 1048.1352 1074.4388 1141.9314 1155.9940 1180.0404 1220.4397 1247.2392 1269.8736 1292.0416 1340.0163 1378.1126 1380.2294 1388.1436 1430.9824 1452.7358 1483.5659 1509.7196 1553.3012 1590.6951 1621.4264 2969.6611 3089.1995 3122.5189 3123.8369 3139.2477 3152.4450 3156.2796 3173.1472 3551.8599
redmass: 4.4207 5.2147 4.2757 3.7299 1.4168 1.9182 5.3241 3.4678 3.2835 3.1091 4.9680 6.5092 6.4567 4.1030 3.8230 4.3616 1.3758 3.4315 5.4750 2.5552 1.7103 1.6646 4.2950 1.5812 1.7372 1.4477 1.3244 2.6553 2.1559 2.6992 1.3859 1.1664 1.1700 2.0045 2.0419 1.7513 1.2248 3.6318 1.3639 1.7507 2.8143 2.7067 2.7499 1.1198 3.5336 6.8747 6.8036 6.3580 1.0691 1.0948 1.0864 1.0889 1.0894 1.0960 1.0949 1.0992 1.0665
irintensity: 3.3675 1.6962 6.2021 2.0539 70.9082 70.0220 1.6448 5.5352 2.1296 0.3940 8.2340 0.4765 3.5755 5.1329 4.9753 2.4871 70.5648 1.0451 0.7880 43.4511 18.5152 3.2260 77.7287 0.8314 0.9945 5.0963 0.1950 4.8338 3.0274 0.9817 4.6091 44.7980 14.0523 0.5818 8.9128 3.4721 23.3545 11.5717 17.9746 13.2370 1.6609 4.2855 3.2804 8.0951 17.9393 9.4080 14.6133 2.5687 59.7070 19.8267 2.8983 17.4176 11.7260 27.1078 17.9751 17.0876 6.9150
temp: 298.150 k
press: 1.00000 atm
elementType: 8 7 6 6 6 6 6 6 6 6 6 6 1 1 1 1 1 1 1 1 1
symmnumber: 1
zpe: 432381.6 jmol-1
zpe.correction: 0.164685 hartree
zpe.thermalcorrener: 0.174296 hartree
zpe.thermalcorrenthalpy: 0.175240 hartree
zpe.thermalcorrgfe: 0.129570 hartree
zpe.sumelectzpe: -515.586043 hartree
zpe.sumelectthermal: -515.576433 hartree
zpe.sumelectthermalent: -515.575488 hartree
zpe.sumelectthermalfe: -515.621159 hartree
dipole: -0.6413 -1.4522 -1.0838
dipole: 1.9222
quadrupole: -68.5089 -67.5311 -73.1278
quadrupole: 10.4970 -5.1075 0.7788
quadrupole: 1.2137 2.1915 -3.4052 10.4970 -5.1075 0.7788
hfenergy: -515.7507287 hartree
pointgroup: C01 [X(C10H9N1O1)]
dipole: -0.315164 -0.5546778 -0.4061168 debye
dipolederiv: -0.2595468 0.1294385 -0.0277141 0.2743676 -0.6996386 0.0635358 -0.1463049 0.1147994 -0.6416803 -0.385082 0.0054229 0.0090353 0.0233847 -0.3092211 0.0042019 0.0138382 0.0008302 -0.2505336 -0.1909844 0.0573881 0.0190723 0.2201109 -0.1250552 -0.0287694 0.0542645 -0.0186278 0.0310694 0.1705107 0.0620752 -0.0079395 -0.0415621 0.1542591 0.016631 0.0585878 -0.0569789 -0.1090169 0.2206535 0.2084377 0.0050866 -0.0094228 0.0476591 -0.0057968 -0.022399 -0.0305807 0.0618873 -0.0487825 -0.0500501 -0.0285267 -0.0426487 0.0381652 0.0293222 -0.0404092 0.0598996 -0.1628634 0.3381751 -0.0768493 -0.0084228 -0.1501295 0.4275934 -0.0690202 -0.0027876 -0.0225011 0.5570763 0.0343717 0.0794072 -0.0069952 -0.0125948 -0.3843132 -0.0041464 -0.0038395 -0.0126253 -0.0954764 -0.0061401 -0.0893296 -0.0265918 -0.1183311 0.0542411 0.0312859 -0.0284665 0.0292946 -0.1363105 -0.0771428 0.0077988 -0.0079659 0.0404958 0.1621064 0.0303091 -0.0028145 0.0298836 -0.1452252 0.1354346 -0.0972012 -0.0288957 0.0723066 0.4575929 0.0237255 -0.0131598 0.0454127 -0.0485158 0.1591922 -0.0156365 -0.0411237 -0.0319458 -0.117602 0.0074266 -0.0451463 0.0030736 -0.1500633 0.0209963 0.1114811 0.0286818 0.0702672 -0.0437175 -0.0239666 0.020337 -0.0392453 0.1378868 0.0402302 -0.052169 -0.1149925 0.0229339 -0.0777003 -0.1071205 -0.0593459 -0.0448234 -0.1163917 -0.0931711 -0.019842 0.0720762 -0.0941019 0.045533 0.0654896 0.0103343 0.0290418 0.0470105 -0.1045288 -0.0456392 0.0258339 -0.0081364 0.0933495 -0.0067384 0.023985 -0.0017084 0.1460505 0.0442259 0.0418787 0.0170602 0.0959238 0.005217 -0.025512 0.0251032 -0.0191244 0.1539697 0.0498118 -0.0758086 0.0036736 -0.0870095 -0.0842675 -0.0164029 0.0050257 -0.0179477 0.1567851 0.0351897 -0.0828574 0.0033036 -0.0890836 -0.1027787 -0.0066333 0.0037834 -0.0090604 0.1245618 -0.1219795 -0.0249163 0.0310893 -0.0296557 0.0886219 -0.0036375 0.0325407 -0.0020135 0.1572295 0.0385663 -0.0730291 0.0842552 -0.1051685 0.3699556 0.0258165 0.1168732 -0.0369985 0.2825501 unknown
polarizability: 155.7895643|15.3929085|135.8752005|-8.5874572|2.0099649|55.6919495 unknown
InChI: InChI=1S/C10H9NO/c12-7-8-5-6-11-10-4-2-1-3-9(8)10/h1-6,12H,7H2
charge 0 multiplicity 1
21 atoms
O  2.57552 -1.94255 0.834922
N  -0.388021 2.174766 0.117862
C  -0.040194 -0.283016 -0.15205
C  1.382573 -0.066214 -0.288734
C  -0.887124 0.876477 0.058909
C  -0.654726 -1.578762 -0.208568
C  2.338318 -1.235411 -0.443139
C  1.855145 1.248776 -0.227414
C  -2.299144 0.700512 0.214116
C  -2.036367 -1.721412 -0.053944
C  0.940842 2.33169 -0.028417
C  -2.865068 -0.575403 0.163001
H  -0.042859 -2.468404 -0.400379
H  1.975081 -1.946409 -1.214056
H  3.336664 -0.880833 -0.743068
H  2.925937 1.458667 -0.320879
H  -2.904221 1.598545 0.371602
H  -2.492086 -2.71639 -0.104555
H  1.313498 3.361994 0.01783
H  -3.946202 -0.703484 0.283108
H  1.702234 -2.161238 1.251152
