program: Gaussian 09
title: 000080689
version: EM64L-G09RevD.01
frameworkgroup: C1[X(C22H12Br4O5)]
method: RPBEPBE
basis: SDD
operation: Freq
keyword: #p
keyword: freq=noraman
keyword: PBEPBE/SDD
title: #p freq=noraman PBEPBE/SDD
converged: YES YES NO NO
title: Mulliken charges:
elementType: Br Br Br Br O O O O O C C C C C C C C C C C C C C C C C C C C C C H H H H H H H H H H H H
charge: 0.104008 0.084875 0.085028 0.073843 -0.249059 -0.292334 -0.373268 -0.183498 -0.244152 0.257676 0.265400 0.254490 0.204625 0.335100 0.393584 0.091994 -0.318984 -0.259047 -0.678650 -0.365083 -0.652945 -0.533495 0.598609 -0.489755 0.347725 -0.353811 -0.229092 -0.223330 0.126017 -0.222770 -0.667865 0.278431 0.273946 0.265286 0.283987 0.244690 0.244559 0.362866 0.238054 0.234961 0.221272 0.228133 0.237979
chargesum: 0.00000
title: Mulliken charges with hydrogens summed into heavy atoms:
elementType: Br Br Br Br O O O O O C C C C C C C C C C C C C C C C C C C C C C
charge: 0.104008 0.084875 0.085028 0.073843 -0.249059 -0.292334 -0.010402 -0.183498 -0.244152 0.257676 0.265400 0.254490 0.204625 0.335100 0.393584 0.091994 -0.040552 0.014899 -0.678650 -0.099796 -0.652945 -0.533495 0.598609 -0.489755 0.347725 -0.069824 0.015598 0.021228 0.126017 0.250244 0.019519
polarizability: 5.39382270e+02 -2.47558494e+01 4.09963586e+02 -2.74140932e+00 -2.82408050e+01 2.00927740e+02
1716.lowfreq: -0.0002 0.0002 0.0004 1.4009 3.8990 5.0320 12.4200 19.1222 21.7718
frequency: 12.2686 19.0900 21.7555 24.9088 33.7832 48.6548 62.6628 66.3953 67.4979 85.6308 86.8832 97.1189 100.4546 119.8483 131.8554 132.2805 135.2970 159.3994 161.3298 188.3977 196.9703 244.8959 255.4724 262.0129 262.0867 265.0387 269.2480 284.2016 302.1808 311.3489 341.6750 348.0576 375.2543 379.4231 390.9243 422.4796 432.5110 472.0020 476.8570 493.7052 504.9643 519.0610 553.1111 593.0256 607.3284 612.0786 631.3056 650.8346 659.9476 667.8302 684.9186 688.2053 721.7477 739.1334 744.1794 758.8828 766.0853 771.5941 790.5328 797.5599 799.3911 805.5110 836.3314 892.1683 897.4386 903.1389 929.6141 957.0030 978.4896 984.3368 1011.9389 1014.9019 1027.1692 1035.2816 1071.2400 1103.7015 1112.4158 1131.9592 1133.5066 1148.6042 1159.4497 1178.8992 1185.8737 1238.2633 1240.5654 1248.7084 1268.9604 1286.9708 1303.4641 1332.8639 1354.4788 1367.3122 1374.6582 1396.0774 1401.4355 1411.0452 1428.6488 1456.8635 1466.5698 1471.1990 1474.7341 1485.2276 1507.2328 1535.4290 1542.5993 1555.3208 1570.7578 1579.7928 1597.6102 1614.3547 1624.7059 2995.5795 3015.2176 3073.9343 3092.2261 3106.0616 3136.8474 3148.3522 3159.9582 3168.3873 3173.6409 3174.3071 3450.8546
redmass: 7.9743 14.6370 4.1089 45.0387 7.4138 5.1010 27.0079 6.5370 4.5921 10.7147 4.9422 3.5274 33.3435 35.9035 6.5533 9.3872 8.4164 8.6252 4.3401 10.0818 13.0752 4.4876 9.8490 7.6758 8.3254 1.8228 6.0660 3.4661 6.9177 7.5933 5.3543 10.3996 5.9112 9.8683 8.0654 6.5767 4.3160 4.9500 5.9210 1.1858 5.0348 4.3678 5.7028 8.1632 8.8214 9.0429 6.0023 7.3200 10.3189 11.3470 4.4952 8.7772 9.2932 8.5851 8.0495 5.1149 6.6732 4.3076 1.4627 1.1960 7.8886 4.8489 5.0957 1.4280 1.4671 1.4001 8.6154 7.1440 4.7702 1.5640 1.3477 2.3122 4.9210 3.3320 3.6483 2.3446 2.1948 3.1263 1.4805 2.2268 4.9872 1.0777 2.9555 2.5352 2.3418 1.1332 1.6943 2.2863 1.7812 7.2920 1.5132 6.1452 4.5244 9.3059 1.2643 9.0563 2.2916 4.5807 1.0414 1.1080 3.0812 1.0719 7.7301 8.3681 9.6919 10.0547 7.4934 8.9819 7.1755 8.7763 9.4136 1.0359 1.0581 1.1061 1.0986 1.1035 1.0869 1.0899 1.0944 1.0921 1.0921 1.1008 1.0647
irintensity: 0.7417 0.0906 0.6156 0.2929 0.3046 0.4355 0.1931 1.9911 1.4441 0.0113 0.1148 0.4086 0.0204 0.3063 1.1964 0.6316 0.8308 0.3015 0.3747 0.7128 0.7411 0.2542 1.3346 1.8835 4.3389 0.4758 6.5839 1.7040 0.7456 3.0062 3.1805 10.2514 3.4551 0.5641 1.6991 2.3301 3.4240 4.5807 27.5613 119.0153 2.9626 3.8084 75.7805 23.6084 15.7458 2.8839 20.6190 4.1117 0.0671 12.6553 43.1185 6.1267 2.2593 49.6098 0.6748 6.1916 8.7773 2.8422 19.3593 9.7382 22.1096 18.7858 10.7637 5.8165 8.0695 10.6150 13.9237 239.1187 4.2808 12.1342 0.3458 19.4364 57.9441 93.6373 38.2464 103.4111 7.1179 12.8503 6.0540 186.2864 144.3711 3.9408 90.9628 104.8852 148.9998 0.0286 106.2974 52.3209 105.4154 62.6484 1.3268 26.4288 66.1780 77.8730 11.0785 0.2415 14.9148 36.8323 15.9813 1.8891 51.1475 18.2572 397.0776 29.1585 120.7395 22.1282 17.6556 170.2821 106.4255 131.6926 21.1915 11.5108 16.7914 1.5434 32.0930 27.1522 0.8248 7.3237 2.7253 2.0217 0.3907 20.6102 112.4778
temp: 298.150 k
press: 1.00000 atm
elementType: 35 35 35 35 8 8 8 8 8 6 6 6 6 6 6 6 6 6 6 6 6 6 6 6 6 6 6 6 6 6 6 1 1 1 1 1 1 1 1 1 1 1 1
symmnumber: 1
zpe: 736503.5 jmol-1
zpe.correction: 0.280519 hartree
zpe.thermalcorrener: 0.309960 hartree
zpe.thermalcorrenthalpy: 0.310904 hartree
zpe.thermalcorrgfe: 0.214266 hartree
zpe.sumelectzpe: -1273.329416 hartree
zpe.sumelectthermal: -1273.299975 hartree
zpe.sumelectthermalent: -1273.299031 hartree
zpe.sumelectthermalfe: -1273.395669 hartree
dipole: -6.1230 3.1511 -0.9732
dipole: 6.9547
quadrupole: -253.1187 -200.8288 -204.0464
quadrupole: 23.1677 0.7890 -16.7346
quadrupole: -33.7874 18.5025 15.2849 23.1677 0.7890 -16.7346
hfenergy: -1273.6099354 hartree
pointgroup: C01 [X(C22H12Br4O5)]
dipole: -2.230355 1.1545963 -1.0858959 debye
polarizability: 524.2887607|-11.1265352|394.3288423|68.2447988|-65.6140559|231.6559937 unknown
InChI: InChI=1S/C22H12Br4O5/c1-2-30-22(29)10-6-4-3-5-9(10)15-11-7-13(23)18(27)16(25)20(11)31-21-12(15)8-14(24)19(28)17(21)26/h3-8,27H,2H2,1H3
charge 0 multiplicity 1
43 atoms
Br -2.5647 -4.226801 0.201239
Br 1.968409 -4.166506 1.219991
Br -5.341381 0.472204 -1.77089
Br 5.213835 0.644204 0.590721
O  -0.208543 -2.2744 0.199213
O  -0.738299 1.645521 1.78559
O  -4.935562 -2.422854 -0.86058
O  4.48914 -2.312279 1.249919
O  -1.17808 3.921506 1.963383
C  -0.051007 0.485413 -0.533425
C  -1.307662 -0.234858 -0.630313
C  1.100751 -0.19326 -0.110379
C  0.009273 1.91867 -0.972269
C  -1.34273 -1.611587 -0.252452
C  1.02548 -1.597772 0.272178
C  -0.360948 3.029752 -0.153559
C  -2.518856 0.364294 -1.081148
C  2.392163 0.449559 0.003562
C  -2.537555 -2.352107 -0.320508
C  0.435822 2.166224 -2.303304
C  2.125566 -2.305497 0.720978
C  -3.705127 -0.369456 -1.151744
C  -3.738411 -1.744641 -0.7716
C  3.493567 -0.244125 0.445572
C  3.46247 -1.684897 0.842569
C  -0.298497 4.344599 -0.688127
C  0.495314 3.47742 -2.822877
C  0.122901 4.573243 -2.011516
C  -0.802264 2.937374 1.278892
C  -1.135222 1.475168 3.221934
C  -0.981665 -0.005378 3.551535
H  -2.514833 1.416052 -1.377642
H  2.470925 1.505565 -0.267023
H  0.72018 1.316622 -2.933448
H  -0.586123 5.172309 -0.031911
H  0.829946 3.638914 -3.852947
H  0.165064 5.593674 -2.405577
H  -4.824156 -3.370956 -0.572839
H  -0.477629 2.118969 3.832862
H  -2.173891 1.834291 3.334058
H  -1.254162 -0.177339 4.608451
H  -1.643417 -0.625396 2.922192
H  0.059713 -0.340642 3.407337
