program: Gaussian 09
title: 000080464
version: EM64L-G09RevD.01
frameworkgroup: C1[X(C7H8N2O2S)]
method: RPBEPBE
basis: SDD
operation: Freq
keyword: #p
keyword: freq=noraman
keyword: PBEPBE/SDD
title: #p freq=noraman PBEPBE/SDD
converged: NO YES NO NO
title: Mulliken charges:
elementType: S O O N N C C C C C C C H H H H H H H H
charge: 0.179525 -0.422948 -0.440623 -0.594998 -0.265451 -0.254326 0.375288 -0.414718 0.309921 -0.333564 -0.337358 -0.099984 0.250138 0.218235 0.251728 0.354451 0.354892 0.333443 0.316136 0.220214
chargesum: 0.00000
title: Mulliken charges with hydrogens summed into heavy atoms:
elementType: S O O N N C C C C C C C
charge: 0.179525 -0.068497 -0.085731 0.054581 -0.045238 -0.254326 0.375288 -0.164580 0.309921 -0.115329 -0.085630 -0.099984
polarizability: 1.61138097e+02 -4.53558821e+00 1.06774723e+02 7.51976921e+00 6.21165651e+00 7.89786626e+01
1716.lowfreq: -6.9146 -4.5786 -0.0031 -0.0020 -0.0013 8.7011 30.0330 43.8628 77.9802
frequency: 29.9109 43.7029 77.9733 137.6406 199.9050 211.1284 277.1005 304.2998 312.3753 344.2784 357.7868 384.7314 420.3859 421.4745 444.0204 454.9908 464.4721 503.7658 558.1486 569.2799 591.9071 678.6963 704.5068 740.9591 745.7403 797.5104 850.9846 879.0086 919.5746 975.2648 1029.1504 1043.9152 1108.5921 1144.1509 1152.1700 1224.6434 1255.7614 1261.2727 1301.2110 1393.1401 1412.8441 1499.3920 1592.8799 1606.8279 1626.8323 1655.1362 3117.8152 3134.2289 3174.9927 3348.2581 3520.6909 3584.0083 3589.5841 3670.7864
redmass: 5.9652 4.8478 5.2759 5.7099 6.2283 6.9535 5.6729 1.1198 1.1338 4.7627 6.4477 1.1012 4.3950 4.8492 1.2793 3.5679 7.3173 4.0905 3.5158 2.8248 4.0082 7.7556 3.6627 1.4309 5.6072 1.5034 1.5128 6.9965 1.3473 1.7880 2.9737 1.5753 1.5708 1.3553 1.1917 1.7026 2.6871 2.8348 1.8104 5.8693 3.5251 2.8949 5.7814 1.2041 6.8477 5.7611 1.0900 1.0923 1.0949 1.0771 1.0444 1.0659 1.0661 1.1043
irintensity: 4.1568 9.0255 2.6927 1.0070 0.7740 3.1035 3.0045 97.6042 165.0080 19.4837 3.0028 50.9057 17.3554 7.1548 223.0905 23.8163 4.5091 5.9428 13.1641 50.9949 35.9273 2.4120 2.8327 67.9123 68.6888 42.8560 28.4167 13.7378 0.1474 147.5577 12.4174 8.5127 258.5756 30.9833 132.6607 15.9911 14.0545 190.2197 21.5709 71.5815 92.0178 91.4377 24.3435 92.2453 11.8232 249.3885 17.1341 4.7714 5.7848 26.1284 30.9629 36.7085 31.9068 19.9050
temp: 298.150 k
press: 1.00000 atm
elementType: 16 8 8 7 7 6 6 6 6 6 6 6 1 1 1 1 1 1 1 1
symmnumber: 1
zpe: 375925.3 jmol-1
zpe.correction: 0.143182 hartree
zpe.thermalcorrener: 0.155641 hartree
zpe.thermalcorrenthalpy: 0.156586 hartree
zpe.thermalcorrgfe: 0.103855 hartree
zpe.sumelectzpe: -928.640982 hartree
zpe.sumelectthermal: -928.628523 hartree
zpe.sumelectthermalent: -928.627579 hartree
zpe.sumelectthermalfe: -928.680310 hartree
dipole: -2.7364 1.7552 0.2430
dipole: 3.2600
quadrupole: -61.9272 -62.5080 -80.3345
quadrupole: -3.3206 -3.9886 3.2039
quadrupole: 6.3294 5.7486 -12.0779 -3.3206 -3.9886 3.2039
hfenergy: -928.7841647 hartree
pointgroup: C01 [X(C7H8N2O2S1)]
dipole: 1.0466062 0.7276956 -0.1417329 debye
dipolederiv: -0.3623479 -0.0707853 0.1579232 -0.1953709 -0.0163625 0.018678 0.256716 -0.0538045 -0.2371891 -0.6142987 -0.6664046 0.0327825 -0.5407062 -0.7662933 -0.1377851 0.0509767 -0.1673339 -0.3290643 -0.9102175 -0.6742327 0.0320407 -0.7529759 -0.717203 -0.1041161 0.0112854 -0.1066327 -0.3993555 -1.2435473 -0.073649 -0.3478348 -0.0875086 -0.6397341 0.0698819 -0.0586399 0.0662712 -0.4215413 -0.3367293 0.0323531 -0.4463733 0.0394288 -0.4122515 -0.1810479 0.0282872 -0.1586602 -1.1497464 0.4354997 0.0017702 0.020582 -0.3401739 0.0281847 -0.0589104 0.1059616 0.0563525 -0.124911 0.2789688 0.7331205 -0.0067118 0.5260166 0.599284 0.0879782 -0.1443747 0.1189324 0.0344941 -0.2528255 -0.307718 0.0642366 0.1883206 -0.0516839 0.0122067 -0.0214199 -0.082988 -0.1261431 0.6789945 0.7284262 0.0140176 0.8150493 0.5937039 0.0649247 0.0407751 0.0865656 0.058669 0.0057205 -0.3068591 0.079871 0.1565483 -0.0054007 -0.0120083 0.0276608 -0.1268082 -0.1481145 -0.0692553 0.082321 0.0392509 -0.3533994 -0.0400951 -0.0941952 0.085526 -0.0060985 -0.127531 1.3615135 0.258622 0.2180315 0.4590523 0.098101 0.1068273 -0.3568982 0.1402938 1.4355323 0.1102731 0.0041284 -0.0324139 -0.0061937 -0.0591099 0.0302288 -0.0250873 0.0310498 0.1454685 0.0595526 -0.0051291 -0.0198482 0.0289951 -0.120842 0.0532898 -0.0261151 0.0571586 0.1515297 -0.0394762 0.0310725 -0.0594754 0.0340229 0.0965436 0.0232681 -0.0641642 0.0261951 0.1504171 0.2256907 0.182971 -0.0655034 0.1091996 0.2270954 0.0684537 -0.0624046 0.1096938 0.3242494 0.2821058 0.1788447 -0.0637767 0.1572046 0.2108488 0.0589069 -0.0574784 0.0675366 0.3549027 0.2811545 -0.0382942 0.0303727 -0.048208 0.347174 -0.0773752 0.0126165 -0.049748 0.156385 0.1491931 -0.0367322 0.052713 -0.0781756 0.3709496 -0.027257 0.0423654 -0.0441517 0.1225291 -0.039969 -0.0538252 0.3001157 -0.1111258 0.2570911 0.0980513 0.1544118 0.0361762 0.1294191 unknown
polarizability: 160.3907187|7.7098162|106.114272|8.3642266|-8.0358767|80.3864914 unknown
InChI: InChI=1S/C7H8N2O2S/c8-7(9)12-6-3-4(10)1-2-5(6)11/h1-3,8,10-11H,9H2
charge 0 multiplicity 1
20 atoms
S  1.596358 -0.875607 1.128732
O  0.76552 1.925453 0.291204
O  -3.439056 -1.812215 -0.129599
N  3.96032 -0.290752 0.013686
N  2.155115 -0.745435 -1.573636
C  -0.038237 -0.345169 0.504939
C  -0.293011 1.008498 0.173933
C  -1.072402 -1.299478 0.406791
C  -2.365471 -0.907812 -0.012427
C  -1.588565 1.390057 -0.251962
C  -2.624633 0.439796 -0.344091
C  2.661246 -0.591362 -0.388278
H  -0.847405 -2.346614 0.641409
H  -1.793611 2.437048 -0.510611
H  -3.627777 0.725672 -0.67242
H  0.481781 2.818817 -0.024622
H  -3.14854 -2.731821 0.088614
H  4.143112 0.027213 0.964285
H  4.718018 -0.267415 -0.6665
H  2.795336 -0.517476 -2.359545
