program: Gaussian 09
title: 000080470
version: EM64L-G09RevD.01
frameworkgroup: C1[X(C9H9NO4)]
method: RPBEPBE
basis: SDD
operation: Freq
keyword: #pfreq=noraman
keyword: PBEPBE/SDD
title: #p freq=noraman PBEPBE/SDD
converged: YES YES NO NO
title: Mulliken charges:
elementType: O O O O N C C C C C C C C C H H H H H H H H H
charge: -0.274042 -0.210779 -0.183810 -0.192960 0.021110 0.335415 0.263270 0.235965 -0.471292 -0.326250 -0.326320 0.132874 -0.785406 -0.512971 0.320947 0.251512 0.258554 0.240941 0.238235 0.267972 0.260665 0.212874 0.243496
chargesum: 0.00000
title: Mulliken charges with hydrogens summed into heavy atoms:
elementType: O O O O N C C C C C C C C C
charge: -0.274042 -0.210779 -0.183810 -0.192960 0.021110 0.335415 0.263270 0.235965 -0.150345 -0.074737 -0.067766 0.132874 -0.038258 0.204065
polarizability: 1.77825810e+02 5.18054057e+00 1.33414802e+02 -2.24740745e+00 -9.66426226e-02 6.16644254e+01
1716.lowfreq: -9.2927 -3.9860 0.0008 0.0009 0.0010 3.9366 41.0276 51.7832 68.8320
frequency: 40.9566 51.7820 68.8248 96.1659 139.8079 144.9271 149.7888 153.9626 195.9941 224.0697 299.9978 309.0805 333.8697 385.3455 424.1082 465.1223 514.8118 543.7189 565.8631 606.8778 648.9233 673.4574 706.1185 744.2606 761.3890 840.3154 850.6568 950.2560 951.7782 962.3464 972.0286 1027.3367 1060.6181 1086.3969 1102.0137 1145.6439 1149.6443 1210.5973 1229.7221 1239.4549 1275.8172 1356.7149 1371.6054 1373.5655 1414.2157 1428.1521 1447.1482 1452.9316 1462.1291 1478.0055 1482.6856 1554.9451 1594.0153 1617.7184 2978.6950 2985.4096 3069.0303 3088.0163 3128.7086 3139.6246 3148.1448 3164.9660 3168.9834
redmass: 5.0894 7.2846 3.9448 3.7817 4.2433 2.7771 1.0805 1.4198 4.1874 5.9717 4.8912 7.3508 7.5565 4.7312 5.3654 4.4870 3.5878 4.5880 4.7144 3.4529 6.9836 4.2981 6.8136 7.6826 4.0756 1.6118 5.2236 4.1158 1.6502 2.0408 1.4121 1.8566 2.1094 3.5283 1.2570 1.4333 1.3267 3.4446 3.0814 2.9664 2.4149 3.3099 4.4848 1.7393 4.7193 1.2643 1.0936 1.0598 1.0498 1.0543 2.8160 7.1640 7.6867 7.5092 1.0329 1.0379 1.0969 1.1013 1.0988 1.1034 1.0880 1.0922 1.0968
irintensity: 2.4891 2.4380 1.8020 5.0411 1.2405 2.0163 0.9699 1.1209 7.2181 4.2102 1.4536 5.2092 0.8322 4.6451 6.3194 2.5759 5.6581 20.2108 17.5093 19.6214 12.5969 2.4304 3.6497 12.6775 6.4864 26.8127 14.2671 58.2995 10.8608 34.1332 7.8880 1.3815 34.3754 18.5539 1.3597 30.2984 3.8925 117.7887 67.6326 313.8964 100.4970 27.1812 77.3452 101.3487 13.4594 6.4674 27.9458 12.0381 22.6103 17.8669 50.8282 36.5831 184.4787 51.4563 66.6070 2.8146 10.9054 22.7105 14.1302 17.3200 4.0104 5.8037 9.4825
temp: 298.150 k
press: 1.00000 atm
elementType: 8 8 8 8 7 6 6 6 6 6 6 6 6 6 1 1 1 1 1 1 1 1 1
symmnumber: 1
zpe: 437888.6 jmol-1
zpe.correction: 0.166783 hartree
zpe.thermalcorrener: 0.180487 hartree
zpe.thermalcorrenthalpy: 0.181431 hartree
zpe.thermalcorrgfe: 0.125347 hartree
zpe.sumelectzpe: -702.869134 hartree
zpe.sumelectthermal: -702.855429 hartree
zpe.sumelectthermalent: -702.854485 hartree
zpe.sumelectthermalfe: -702.910570 hartree
dipole: 1.3950 -7.0133 1.0693
dipole: 7.2302
quadrupole: -81.2397 -83.4872 -82.1271
quadrupole: -1.1073 -4.6226 -1.2006
quadrupole: 1.0450 -1.2025 0.1576 -1.1073 -4.6226 -1.2006
hfenergy: -703.0359166 hartree
pointgroup: C01 [X(C9H9N1O4)]
dipole: 0.6267122 -2.7434024 0.4153865 debye
dipolederiv: -1.4457761 -0.5086925 0.2706653 -0.4841218 -0.5616453 0.1162926 0.0739787 0.0382054 -0.4121342 -0.8284265 -0.1222784 0.0158894 -0.3798732 -0.7834076 -0.0350544 -0.0148612 -0.044047 -0.3085712 -0.4000853 0.0652842 0.1012176 0.0674186 -0.7794696 0.2198457 0.1242356 0.1441531 -0.3490522 -0.70815 0.0256537 0.2759933 0.1100474 -0.4410328 0.0720636 0.2374071 0.153506 -0.3901493 1.0470628 -0.3523401 -0.4458835 -0.4009082 1.2194958 -0.3114999 -0.3786148 -0.2738053 0.5371196 -0.832637 -0.0445503 0.0284833 -0.0505778 -0.2771882 -0.0107762 0.010354 -0.0205741 -0.021983 -0.3410262 0.1552264 0.0899801 -0.0276726 -0.3269736 0.0241786 0.0598738 0.013917 0.003354 1.2531007 0.499637 -0.0934027 0.0962403 0.4868068 0.0286814 0.2125184 0.043148 -0.0019534 0.1943402 -0.1213104 0.0030277 -0.0843823 -0.025212 0.0010656 -0.0714194 0.0612381 -0.0396619 0.2510154 0.0279947 -0.0132593 0.1499967 0.1465255 0.0067481 0.019588 0.0286712 -0.1046682 -0.5780145 -0.0497979 0.0542552 0.2717182 0.0703588 0.0208115 0.0159652 0.0329763 -0.132187 1.8123418 0.0820277 -0.0680699 0.217212 0.8656615 0.0710787 -0.0376994 0.0630981 0.1338662 -0.3631402 0.1991716 0.0375831 0.3215369 -0.241117 -0.0434855 0.0415529 -0.033316 0.0437809 0.6012771 0.1641693 -0.1912395 0.2565482 0.390949 -0.1297194 -0.4113598 -0.2305075 0.4687514 0.1601373 -0.0144797 -0.006703 0.0145511 0.0876724 -0.0100473 0.0235067 -0.0136733 0.1556272 0.0193788 0.0934822 0.0118736 0.0998172 0.0286648 -0.0139279 0.0170125 -0.0155796 0.1382902 0.0628631 -0.0495748 -0.0092773 -0.0432342 -0.0367225 -0.0177435 -0.0237641 -0.0185953 0.155284 0.09295 -0.0158968 -0.0687565 -0.0095704 0.0594373 -0.0803325 -0.0368852 -0.0853212 -0.0302221 0.0975491 -0.0209905 0.0582938 -0.0073535 0.024025 0.0934553 0.0275664 0.0989432 -0.0043338 -0.0736127 -0.0353291 0.0041777 -0.1075158 0.0683413 -0.0016487 -0.0041848 -0.0036626 0.1247594 0.0769953 -0.0106886 0.0110515 0.0413532 0.0242734 -0.1233114 0.1038318 -0.0291189 -0.0260695 0.007085 0.1226574 -0.0419886 0.0284167 -0.0851166 0.118118 0.065069 0.1012381 -0.0011255 -0.1052281 -0.0893753 -0.0239113 -0.0796468 0.0856733 0.0052075 -0.0536713 -0.0108936 0.0612782 unknown
polarizability: 176.2149336|5.5508133|133.5274131|-13.1776198|-2.0130992|63.162691 unknown
InChI: InChI=1S/C9H9NO4/c1-6(11)7-3-4-9(14-2)8(5-7)10(12)13/h3-5H,1-2H3
charge 0 multiplicity 1
23 atoms
O  -2.505542 -1.221169 -0.293977
O  3.3272 1.545503 -0.047738
O  -1.500913 2.724112 -0.453185
O  -2.824206 1.352466 0.800823
N  -1.765126 1.591526 0.103193
C  1.595074 -0.120491 -0.15381
C  -0.76474 0.507289 -0.037592
C  -1.169043 -0.857381 -0.1412
C  0.59092 0.874148 -0.066954
C  1.204139 -1.484354 -0.240927
C  -0.156847 -1.842446 -0.24421
C  3.036467 0.32005 -0.157159
C  4.125838 -0.736075 -0.295358
C  -3.218251 -1.7099 0.910865
H  0.884375 1.927624 -0.014784
H  1.961472 -2.270358 -0.322627
H  -0.465622 -2.886295 -0.359489
H  4.017306 -1.298992 -1.241287
H  4.081494 -1.46685 0.533896
H  5.107807 -0.240313 -0.283369
H  -3.320985 -0.886747 1.637505
H  -2.68352 -2.569854 1.357946
H  -4.206695 -2.025895 0.548138
