program: Gaussian 09
title: 000080431
version: EM64L-G09RevD.01
frameworkgroup: C1[X(C9H12S)]
method: RPBEPBE
basis: SDD
operation: Freq
keyword: #pfreq=noraman
keyword: PBEPBE/SDD
title: #p freq=noraman PBEPBE/SDD
converged: NO YES NO NO
title: Mulliken charges:
elementType: S C C C C C C C C C H H H H H H H H H H H H
charge: 0.160920 0.486619 -0.808689 -0.376598 -0.376584 -0.587191 -0.220667 -0.220669 -0.238133 -0.655368 0.258476 0.258479 0.245450 0.245445 0.234719 0.234718 0.225527 0.225526 0.230432 0.230432 0.219014 0.228143
chargesum: 0.00000
title: Mulliken charges with hydrogens summed into heavy atoms:
elementType: S C C C C C C C C C
charge: 0.160920 0.486619 -0.291734 -0.141880 -0.141866 -0.096296 0.004859 0.004857 -0.009990 0.024511
polarizability: 1.68822105e+02 3.52709277e-04 1.01054484e+02 1.17780050e+01 2.30815522e-04 7.35567447e+01
1716.lowfreq: 0.0020 0.0025 0.0027 6.7266 8.3827 13.9782 28.3109 46.4988 66.8633
frequency: 27.0141 46.3796 66.2688 69.3703 155.0156 234.2358 240.3061 318.3634 324.7367 401.7763 478.1360 552.4296 616.8541 627.8994 666.2202 702.1177 777.8083 789.2754 806.3335 850.8441 893.8336 924.3210 975.3793 989.4319 995.3077 995.9697 1025.3695 1030.7194 1065.1222 1071.0671 1126.0616 1172.2666 1186.3424 1218.0077 1229.6684 1239.6813 1288.8293 1324.0462 1384.5683 1396.0737 1440.0215 1456.7598 1462.9574 1470.0181 1482.4236 1483.9632 1592.9380 1613.4487 2983.6160 2999.0963 3005.9480 3059.9635 3076.0794 3077.9340 3094.5390 3118.7325 3120.9470 3134.0090 3145.4263 3162.4186
redmass: 3.4697 4.6436 2.0093 4.4260 4.8491 4.5322 1.1012 3.6499 2.3066 2.8012 3.7173 5.4062 6.3385 4.7907 4.5738 1.6286 2.2250 1.1116 3.8500 1.2499 1.4743 1.4566 1.3910 5.6683 1.3835 1.7746 2.1993 1.2067 2.2013 1.4934 1.0933 1.0524 1.1124 1.8158 1.6036 1.2363 1.2723 1.2786 8.6491 1.2032 2.1977 1.0999 1.0994 1.0392 2.3404 1.0518 6.0897 6.1721 1.0354 1.0566 1.0565 1.1064 1.1085 1.0989 1.1028 1.0849 1.0880 1.0920 1.0964 1.1017
irintensity: 0.0117 2.5800 0.0025 0.9906 0.4673 0.1162 0.0736 1.5585 0.5960 0.0020 6.3430 3.2302 0.1379 8.6603 18.8054 63.6891 26.2654 8.9159 6.8171 0.0415 1.3989 2.7621 0.0172 0.0480 2.2376 15.3271 7.5238 0.9445 7.5214 8.2918 2.4696 0.0526 0.6462 3.2211 26.5727 0.1377 12.4850 0.1654 0.0784 17.8616 7.8703 7.3990 3.7810 14.7681 13.9687 8.9639 1.0513 3.1443 38.5843 45.5704 21.6236 9.1986 13.7053 33.2985 45.4271 6.0227 1.4064 15.4296 44.2972 22.5127
temp: 298.150 k
press: 1.00000 atm
elementType: 16 6 6 6 6 6 6 6 6 6 1 1 1 1 1 1 1 1 1 1 1 1
symmnumber: 1
zpe: 480089.5 jmol-1
zpe.correction: 0.182856 hartree
zpe.thermalcorrener: 0.193585 hartree
zpe.thermalcorrenthalpy: 0.194530 hartree
zpe.thermalcorrgfe: 0.144330 hartree
zpe.sumelectzpe: -747.462242 hartree
zpe.sumelectthermal: -747.451513 hartree
zpe.sumelectthermalent: -747.450569 hartree
zpe.sumelectthermalfe: -747.500769 hartree
dipole: 0.5776 0.0000 1.5669
dipole: 1.6699
quadrupole: -57.9489 -63.5993 -70.9093
quadrupole: 0.0000 5.2158 0.0001
quadrupole: 6.2036 0.5532 -6.7568 0.0000 5.2158 0.0001
hfenergy: -747.6450986 hartree
pointgroup: C01 [X(C9H12S1)]
dipole: 0.2327335 0.0000147 -0.6144058 debye
dipolederiv: -0.4272288 0.000009 -0.0231998 0.0000049 -0.1892432 -0.0000047 -0.0093027 -0.0000038 -0.0519559 0.2585958 -0.0000008 -0.0266933 0.0000123 -0.0189356 0.0000071 -0.1421042 0.0000106 -0.0753118 0.2690199 -0.0000095 0.127789 -0.000004 0.145626 -0.0000125 0.1768955 -0.0000181 0.1965517 -0.0939195 0.074793 -0.0373673 0.0599251 0.0468676 -0.0226715 -0.0022252 -0.0122515 -0.1432152 -0.0939097 -0.0747939 -0.0373701 -0.05994 0.0468584 0.0226825 -0.0022185 0.0122598 -0.1432138 0.3958608 -0.0000095 -0.1256183 -0.0000106 0.1794224 0.0000084 -0.2887556 0.0000134 0.0546289 -0.038273 -0.0823448 -0.0437421 -0.1000621 0.0832777 0.0223985 -0.0346517 0.0310089 -0.1280891 -0.0382748 0.082344 -0.0437363 0.1000577 0.0832877 -0.0223864 -0.0346526 -0.0310009 -0.1280918 0.0356764 0.0000059 -0.0894783 0.0000059 -0.0630337 0.0000023 -0.0725462 0.0000022 -0.1380522 -0.179958 0.0000053 -0.0773438 0.0000085 0.063077 0.0000008 0.1374071 -0.0000058 0.0307727 -0.0310756 0.0160241 -0.0058978 0.0371898 -0.0445812 -0.1198912 -0.0479174 -0.0731611 -0.045936 -0.0310749 -0.0160188 -0.0059042 -0.0371848 -0.0446094 0.1198925 -0.0479249 0.073169 -0.0459102 -0.0512352 -0.0117595 0.0129731 0.0180817 -0.0608472 -0.1261999 0.0676386 -0.116946 -0.0540304 -0.0512311 0.0117607 0.0129808 -0.0180821 -0.0608498 0.1262002 0.0676445 0.1169411 -0.054029 0.050077 -0.1002784 0.0443047 -0.0887083 -0.0471177 0.0246321 0.0338031 0.0318621 0.1273276 0.0500729 0.1002759 0.0443109 0.088711 -0.0471085 -0.0246422 0.0338082 -0.0318688 0.1273224 0.0270987 0.0859706 0.0380824 0.1048649 -0.0768277 -0.0295054 0.0463633 -0.0289851 0.144044 0.0271048 -0.0859685 0.0380759 -0.1048643 -0.0768357 0.0294922 0.0463559 0.028973 0.144047 0.1259237 0.029427 0.0174262 -0.0181415 -0.0623121 -0.1206054 -0.0466433 -0.1083613 0.0083981 0.1259224 -0.0294377 0.0174333 0.0181295 -0.0623068 0.1206047 -0.0466383 0.1083652 0.0083959 -0.2139395 0.0000109 0.0747735 0.0000106 0.1191763 -0.0000014 0.0735502 -0.0000023 0.035013 -0.1152323 -0.0000051 0.0882014 -0.0000042 0.0870156 -0.0000007 0.092114 -0.0000005 0.1313342 unknown
polarizability: 169.0243925|-0.0017325|101.0544836|-10.9274652|0.0004409|73.3544573 unknown
InChI: InChI=1S/C9H12S/c1-2-10-8-9-6-4-3-5-7-9/h3-7H,2,8H2,1H3
charge 0 multiplicity 1
22 atoms
S  2.045519 -0.000009 0.563532
C  -0.580893 0.000104 -0.45131
C  0.8523 0.000132 -0.932404
C  -1.264277 1.221281 -0.214398
C  -1.264239 -1.22111 -0.214481
C  3.686689 -0.00006 -0.393131
C  -2.600896 1.222946 0.242724
C  -2.600858 -1.22285 0.242641
C  -3.274359 0.00003 0.471522
C  4.856025 -0.000089 0.604354
H  1.079091 -0.900615 -1.529075
H  1.079111 0.900969 -1.52893
H  3.708345 -0.899088 -1.035577
H  3.708399 0.89897 -1.03558
H  -0.741262 2.170345 -0.384883
H  -0.741193 -2.170153 -0.38502
H  -3.11594 2.174203 0.419173
H  -3.115874 -2.174134 0.419031
H  4.82578 0.894124 1.252317
H  4.82573 -0.894288 1.252331
H  5.820485 -0.000115 0.063048
H  -4.312083 0.000007 0.824115
