program: Gaussian 09
title: 000080451
version: EM64L-G09RevD.01
frameworkgroup: C1[X(C12H14O3)]
method: RPBEPBE
basis: SDD
operation: Freq
keyword: #pfreq=noraman
keyword: PBEPBE/SDD
title: #p freq=noraman PBEPBE/SDD
converged: YES YES NO NO
title: Mulliken charges:
elementType: O O O C C C C C C C C C C C C H H H H H H H H H H H H H H
charge: -0.260780 -0.226233 -0.250409 -0.505482 -0.516274 0.126726 0.282251 0.241783 -0.344151 -0.346418 -0.228457 -0.245943 -0.229435 -0.223242 -0.671816 0.254277 0.253938 0.266638 0.266155 0.251858 0.277701 0.227330 0.227363 0.232105 0.233794 0.233962 0.210935 0.230893 0.230933
chargesum: 0.00000
title: Mulliken charges with hydrogens summed into heavy atoms:
elementType: O O O C C C C C C C C C C C C
charge: -0.260780 -0.226233 -0.250409 0.002732 0.016518 0.126726 0.282251 0.241783 -0.092293 -0.068717 0.226236 -0.013838 0.004360 0.010720 0.000946
polarizability: 2.00023676e+02 -1.06388343e+01 1.38555136e+02 -3.62815210e-03 2.73186558e-02 7.29359113e+01
1716.lowfreq: -15.4255 -1.9397 -0.0008 -0.0006 -0.0003 4.0474 8.1212 28.7762 52.6145
frequency: -15.0845 28.2034 52.5194 52.9153 66.2914 89.7849 134.9876 141.8832 159.9430 203.7652 234.2926 248.4742 315.8242 354.4435 400.5074 415.6050 423.4127 503.2797 541.3696 565.1734 612.5157 618.6141 681.7742 697.7176 755.8263 781.6400 799.3807 808.7321 826.8664 861.0655 921.5644 944.3955 983.2107 990.2940 993.0067 1006.6129 1017.2621 1023.5595 1027.8754 1084.7082 1099.0259 1113.9824 1136.2083 1136.5714 1141.2655 1173.4854 1190.6543 1216.2916 1248.8515 1270.0954 1291.3498 1319.4146 1353.5181 1369.5256 1387.7683 1402.6109 1435.1579 1436.1709 1441.1874 1463.5667 1474.3084 1480.6820 1486.9107 1568.7196 1598.2395 1612.5162 1633.2207 2990.7452 2996.6774 3009.8103 3019.2855 3036.1382 3068.3015 3071.1986 3093.0668 3108.5571 3129.3875 3139.7193 3151.3143 3160.3334 3170.2563
redmass: 6.5402 3.8782 3.9002 4.6598 2.6139 2.0772 4.7249 2.0395 3.8024 6.3695 4.9992 1.2778 7.7374 3.7462 2.8225 3.1957 5.4874 4.4043 2.3654 2.4495 6.4947 7.5157 6.3947 1.8543 1.5639 5.2006 1.1053 1.7537 3.7616 1.2472 5.1271 1.3974 4.6467 6.1954 1.3790 1.6358 1.7856 2.3420 2.0907 1.6539 3.0830 2.2624 1.4735 2.7251 1.2019 1.0678 1.1254 2.2100 1.1354 1.1149 2.1744 1.3477 1.4583 1.7994 9.2876 1.2708 1.1095 2.2435 1.1201 1.0398 1.0593 2.1586 1.0708 7.0262 6.7879 6.4566 9.5527 1.0616 1.0360 1.0583 1.0616 1.0973 1.1066 1.0989 1.0985 1.1025 1.0852 1.0881 1.0923 1.0959 1.1012
irintensity: 4.1477 0.0545 1.3521 2.0822 0.2245 0.9245 0.4544 8.5615 1.4522 0.3470 23.3533 1.8300 0.1645 7.7410 0.0987 1.4611 1.0799 21.6484 1.3253 3.2475 0.5394 21.2878 2.4927 46.7606 83.2768 6.4793 3.5353 0.1253 13.6942 0.4892 31.6131 1.4846 16.5418 5.9212 0.3920 0.1698 1.5313 29.5592 23.2565 22.8010 46.0612 6.6470 10.8449 374.9070 0.1375 0.7630 13.9340 16.3189 0.0057 0.4269 369.6267 20.6373 5.8116 2.1024 2.9068 18.5042 4.7467 19.4555 46.4081 11.9719 5.0478 0.8064 13.5152 114.9400 54.6855 13.4741 129.8879 19.3991 21.6800 20.3222 10.4263 3.5385 7.9090 9.4538 30.1464 44.7405 0.1281 6.7725 15.5099 22.2640 19.3873
temp: 298.150 k
press: 1.00000 atm
elementType: 8 8 8 6 6 6 6 6 6 6 6 6 6 6 6 1 1 1 1 1 1 1 1 1 1 1 1 1 1
symmnumber: 1
zpe: 610067.9 jmol-1
zpe.correction: 0.232363 hartree
zpe.thermalcorrener: 0.246716 hartree
zpe.thermalcorrenthalpy: 0.247660 hartree
zpe.thermalcorrgfe: 0.189107 hartree
zpe.sumelectzpe: -690.243533 hartree
zpe.sumelectthermal: -690.229180 hartree
zpe.sumelectthermalent: -690.228235 hartree
zpe.sumelectthermalfe: -690.286788 hartree
dipole: -0.2726 1.5243 0.0129
dipole: 1.5485
quadrupole: -59.8362 -94.9607 -89.1931
quadrupole: -4.2802 0.0011 0.0231
quadrupole: 21.4938 -13.6307 -7.8631 -4.2802 0.0011 0.0231
hfenergy: -690.4758955 hartree
pointgroup: C01 [X(C12H14O3)]
dipole: 0.1032866 -0.6003477 0.008512 debye
polarizability: 199.8802685|-11.0426226|138.6958759|0.2324846|-0.4023239|72.9385789 unknown
InChI: InChI=1S/C12H14O3/c1-2-15-12(14)9-8-11(13)10-6-4-3-5-7-10/h3-7H,2,8-9H2,1H3
charge 0 multiplicity 1
29 atoms
O  -4.022335 0.334409 -0.010607
O  0.724339 2.067071 -0.018379
O  -2.750616 -1.617865 -0.005782
C  -0.297598 -0.143685 -0.002733
C  -1.640931 0.598099 -0.007071
C  0.897167 0.811124 -0.008703
C  2.283107 0.22878 -0.003037
C  -2.814939 -0.364694 -0.007502
C  2.522983 -1.172348 0.006718
C  3.390323 1.120947 -0.007677
C  -5.266664 -0.497317 -0.011413
C  3.844107 -1.66878 0.011776
C  4.708207 0.624709 -0.002609
C  4.938698 -0.772874 0.007162
C  -6.443162 0.472808 -0.012037
H  -0.232963 -0.820212 -0.877244
H  -0.23265 -0.809784 0.879684
H  -1.72119 1.266647 -0.883487
H  -1.72512 1.269999 0.866438
H  1.68634 -1.878707 0.010283
H  3.183863 2.196443 -0.01523
H  -5.2495 -1.145969 -0.906011
H  -5.250565 -1.14626 0.882986
H  4.021478 -2.749685 0.019273
H  5.555389 1.319172 -0.006224
H  5.96373 -1.160237 0.011121
H  -7.39381 -0.091096 -0.012766
H  -6.422334 1.118251 0.882586
H  -6.421154 1.118552 -0.906414
