program: Gaussian 09
title: 000080450
version: EM64L-G09RevD.01
frameworkgroup: C1[X(C10H12N2O3)]
method: RPBEPBE
basis: SDD
operation: Freq
keyword: #p
keyword: freq=noraman
keyword: PBEPBE/SDD
title: #p freq=noraman PBEPBE/SDD
converged: YES YES NO NO
title: Mulliken charges:
elementType: O O O N N C C C C C C C C C C H H H H H H H H H H H H
charge: -0.270683 -0.210514 -0.210592 -0.361372 0.026301 -0.563462 0.503644 -0.382024 -0.373568 -0.376318 -0.359205 -0.353786 0.367775 0.251897 -0.764684 0.221559 0.260513 0.263240 0.224145 0.255970 0.245820 0.309950 0.286123 0.285791 0.253259 0.257838 0.212381
chargesum: 0.00000
title: Mulliken charges with hydrogens summed into heavy atoms:
elementType: O O O N N C C C C C C C C C C
charge: -0.270683 -0.210514 -0.210592 -0.051422 0.026301 -0.081389 0.503644 0.105361 -0.117597 -0.130497 -0.073082 -0.067995 0.367775 0.251897 -0.041205
polarizability: 1.89659608e+02 -1.00893141e+01 1.36994311e+02 2.07118691e+01 1.25833347e+01 8.54232402e+01
1716.lowfreq: -14.2255 -4.8333 -0.0005 -0.0004 -0.0002 3.4936 19.7484 26.2585 39.0117
frequency: 19.5354 26.2099 39.0005 68.9536 75.2579 77.6907 102.7624 159.1137 213.0092 272.4930 294.0047 340.9676 363.9575 397.4427 409.0632 446.3666 506.8863 514.8549 538.5153 584.1112 603.5095 624.6717 627.5514 672.8599 733.1841 740.7441 798.3813 814.7011 854.1711 867.7084 900.0815 953.7839 981.2399 987.6195 995.8705 1005.9357 1030.8523 1041.1117 1093.0782 1097.5817 1112.2892 1180.4822 1183.1242 1214.2299 1222.0665 1238.9057 1272.9711 1300.4613 1314.9583 1362.8347 1365.8239 1387.4826 1401.4965 1418.7947 1438.2122 1449.0948 1465.8493 1476.8339 1480.3979 1487.2580 1594.3058 1606.6497 1617.2057 2996.4262 3002.9719 3013.0351 3068.6014 3084.2630 3096.4582 3102.2445 3134.4980 3145.6671 3180.7576 3183.1531 3565.7617
redmass: 6.2986 5.4232 4.6230 6.2162 1.2555 4.1812 3.1031 5.4641 5.1110 3.4605 3.7271 4.9314 2.9039 3.0948 2.9125 2.7345 6.7532 1.7680 1.9476 3.8940 3.0695 3.5424 6.7249 4.4249 4.9209 3.7122 4.5318 2.8988 1.2451 1.8760 2.4552 2.2958 1.7517 1.3433 1.3698 2.9878 1.9032 1.6656 3.2814 3.6468 1.3509 1.3356 1.2095 2.6961 4.8256 1.5198 1.7265 1.2886 1.2414 2.2972 2.1275 1.2258 7.9235 3.2426 1.1630 1.0464 1.1068 1.2068 2.0147 1.8592 7.6303 6.2692 6.1247 1.0363 1.0609 1.0602 1.1012 1.1050 1.0994 1.0992 1.0906 1.0905 1.0943 1.0954 1.0784
irintensity: 4.9609 3.3670 10.3683 0.1856 2.8473 3.3167 2.2815 3.3966 0.3795 4.1975 5.3014 1.2004 0.1907 3.1783 0.1223 20.8385 0.9830 41.1821 103.2452 2.8994 3.9697 3.4549 0.2504 30.4309 11.7606 2.6466 25.6044 8.1048 0.2253 29.9712 8.7222 0.2948 5.5792 3.8364 0.1161 2.9426 29.0267 8.8684 27.1476 25.0210 16.5863 81.5881 0.5517 21.8468 310.5830 20.8265 76.5029 2.4737 32.7236 63.4862 37.0312 57.4791 0.7119 44.0199 43.3913 17.1287 68.4377 12.4279 35.2494 135.7423 2.0787 84.2086 160.7644 9.2697 16.6107 33.2103 10.8619 10.3494 16.0905 12.7306 10.9307 8.5050 0.0327 4.2823 12.8362
temp: 298.150 k
press: 1.00000 atm
elementType: 8 8 8 7 7 6 6 6 6 6 6 6 6 6 6 1 1 1 1 1 1 1 1 1 1 1 1
symmnumber: 1
zpe: 550523.8 jmol-1
zpe.correction: 0.209683 hartree
zpe.thermalcorrener: 0.224331 hartree
zpe.thermalcorrenthalpy: 0.225275 hartree
zpe.thermalcorrgfe: 0.164684 hartree
zpe.sumelectzpe: -722.266108 hartree
zpe.sumelectthermal: -722.251461 hartree
zpe.sumelectthermalent: -722.250516 hartree
zpe.sumelectthermalfe: -722.311107 hartree
dipole: 2.9325 -1.3408 -1.9949
dipole: 3.7917
quadrupole: -129.9632 -79.5893 -86.8490
quadrupole: 10.5235 -10.6777 0.6631
quadrupole: -31.1627 19.2112 11.9515 10.5235 -10.6777 0.6631
hfenergy: -722.4757912 hartree
pointgroup: C01 [X(C10H12N2O3)]
dipole: -1.1460165 0.5145038 -0.8045662 debye
polarizability: 190.2970923|-9.7990694|136.6662556|-19.1666107|-13.2627153|85.1138115 unknown
InChI: InChI=1S/C10H12N2O3/c1-8(13)11-7-6-9-2-4-10(5-3-9)12(14)15/h2-5,11H,6-7H2,1H3
charge 0 multiplicity 1
27 atoms
O  -4.442288 -0.196705 0.630079
O  3.959359 -1.860631 0.308565
O  4.651638 0.081536 -0.667849
N  -2.703647 -0.064642 -0.900515
N  3.752847 -0.651409 -0.097763
C  -1.560127 1.606428 0.626567
C  -0.165393 1.033741 0.47381
C  -2.45614 1.358138 -0.629016
C  0.127573 -0.287894 0.908547
C  0.866823 1.787559 -0.149723
C  1.406469 -0.84963 0.727085
C  2.152592 1.247394 -0.34125
C  2.403442 -0.071248 0.099092
C  -3.705133 -0.760791 -0.235955
C  -3.866796 -2.227334 -0.625043
H  -1.512901 2.700084 0.787545
H  -2.078615 1.164992 1.495863
H  -3.433762 1.838828 -0.449528
H  -1.99448 1.812567 -1.524089
H  -0.654412 -0.871833 1.406038
H  0.66057 2.812791 -0.478831
H  -2.096944 -0.558588 -1.55545
H  1.647603 -1.862087 1.061714
H  2.957008 1.817399 -0.813584
H  -3.821999 -2.850808 0.283962
H  -4.866838 -2.372675 -1.069427
H  -3.105752 -2.581381 -1.342045
