program: Gaussian 09
title: 000080407
version: EM64L-G09RevD.01
frameworkgroup: C1[X(C8H10OS)]
method: RPBEPBE
basis: SDD
operation: Freq
keyword: #p
keyword: freq=noraman
keyword: PBEPBE/SDD
title: #p freq=noraman PBEPBE/SDD
converged: YES YES NO NO
title: Mulliken charges:
elementType: S O C C C C C C C C H H H H H H H H H H
charge: -0.040750 -0.265429 0.503824 -0.317905 -0.409914 0.321895 -0.863428 -0.345334 -0.343905 -0.538162 0.244041 0.229546 0.266855 0.278273 0.250838 0.240367 0.221097 0.220981 0.246117 0.100992
chargesum: 0.00000
title: Mulliken charges with hydrogens summed into heavy atoms:
elementType: S O C C C C C C C C
charge: 0.060242 -0.265429 0.503824 -0.073864 -0.180368 0.321895 -0.318299 -0.094495 -0.103538 0.150033
polarizability: 1.58795911e+02 4.72682317e+00 9.52507605e+01 -3.09407126e+00 -1.38077208e+00 6.76398324e+01
1716.lowfreq: -8.6843 0.0016 0.0026 0.0030 4.5830 17.9368 36.7844 71.7528 113.4013
frequency: 36.3618 71.7375 113.3923 175.4535 186.3614 220.5727 248.1040 331.8982 351.0710 410.9790 422.2983 500.9038 529.6569 613.8667 632.6842 714.4857 729.9411 768.8580 812.2652 817.4357 835.7030 930.4219 957.0210 965.6870 988.8701 1001.9761 1108.4944 1114.3227 1156.5086 1160.4890 1178.7837 1220.0815 1233.6942 1249.8644 1305.6485 1383.5486 1419.3838 1438.5008 1455.8696 1468.7526 1474.2527 1502.2409 1583.4509 1622.0070 2434.1813 2959.8150 3032.5088 3047.3870 3102.2305 3120.3088 3125.4373 3134.4185 3161.9607 3168.2058
redmass: 4.1491 4.3284 3.8923 1.3298 3.0156 2.3856 1.2306 2.4903 5.4486 3.2130 4.2561 3.2893 3.5036 3.9607 5.5191 4.7446 2.9910 1.3780 1.3795 3.7002 1.6267 1.3466 1.4661 1.4238 8.5390 2.6409 1.3381 1.2599 1.2508 1.1219 1.2189 2.1367 4.9202 1.2384 1.2964 4.8862 3.6096 1.1693 1.1151 1.0497 1.0758 2.4949 7.0034 6.3787 1.0384 1.0330 1.0583 1.1039 1.1071 1.0895 1.0993 1.0892 1.0936 1.0959
irintensity: 0.0879 1.0860 5.6355 14.3140 3.6499 18.5078 0.1704 2.8626 0.8260 1.4657 1.6771 7.6953 24.0617 40.6476 4.3238 3.0095 3.1214 1.9934 18.6852 8.6925 51.1207 1.4754 4.0266 1.4355 40.6571 7.2816 18.4721 0.2456 0.4668 4.4463 57.3851 18.0538 178.2307 7.3025 0.8152 11.1806 4.9112 9.1087 9.1760 13.3942 52.2099 93.9213 11.2859 67.2619 26.3163 68.0195 24.6328 49.8775 6.0681 21.9636 19.1521 8.8146 15.7983 4.3310
temp: 298.150 k
press: 1.00000 atm
elementType: 16 8 6 6 6 6 6 6 6 6 1 1 1 1 1 1 1 1 1 1
symmnumber: 1
zpe: 411098.8 jmol-1
zpe.correction: 0.156579 hartree
zpe.thermalcorrener: 0.166958 hartree
zpe.thermalcorrenthalpy: 0.167903 hartree
zpe.thermalcorrgfe: 0.119789 hartree
zpe.sumelectzpe: -783.365264 hartree
zpe.sumelectthermal: -783.354885 hartree
zpe.sumelectthermalent: -783.353941 hartree
zpe.sumelectthermalfe: -783.402055 hartree
dipole: -2.5097 -2.2870 -0.2732
dipole: 3.4064
quadrupole: -67.2745 -62.7123 -67.8003
quadrupole: 3.9389 -4.2928 -2.0582
quadrupole: -1.3455 3.2167 -1.8712 3.9389 -4.2928 -2.0582
hfenergy: -783.5218436 hartree
pointgroup: C01 [X(C8H10O1S1)]
dipole: 0.9485735 -0.8882988 0.3273776 debye
dipolederiv: -0.4379814 -0.1646693 -0.049559 -0.2197724 -0.0392194 0.0428039 -0.2987316 0.0757192 -0.219204 -1.8083518 0.1958862 0.1081533 0.0688796 -0.3378983 -0.0053116 0.2098609 -0.0227377 -0.314245 -0.0546187 0.0217769 -0.0118272 0.0020513 -0.1708853 0.0494115 0.0470823 0.0232073 -0.1670767 0.1215627 0.0154672 -0.0345443 0.0010911 0.1133576 -0.0414489 0.0075764 -0.0569326 -0.1204437 0.1143422 -0.0854416 -0.0401316 -0.0067976 0.1181141 -0.0674217 -0.0782562 -0.033669 -0.1299936 1.56048 -0.0339764 -0.1585214 0.2522795 0.0392277 -0.0120188 -0.2584841 0.0173752 0.1228223 0.5126217 0.0149022 0.1184377 0.1049981 0.0908635 0.028554 0.2719866 -0.047169 0.3587682 -0.3992667 0.0047281 0.0042741 0.2527752 0.0423305 -0.0573352 -0.0201757 -0.0473691 -0.1577533 -0.3556986 0.0152903 -0.0101925 -0.3608611 -0.048613 0.0046003 0.1049692 -0.0338525 -0.1927384 0.6707345 -0.1500393 -0.0032732 -0.5017899 0.388099 0.037857 0.03503 0.010836 0.3206836 0.0224815 0.1043186 0.0088413 0.0863547 -0.0109976 0.0198841 -0.003089 0.0198577 0.1364688 0.0392144 -0.0872686 0.040457 -0.0825707 -0.0625416 0.0456145 0.0252359 0.0490024 0.1239181 0.0065673 0.0286047 -0.0573458 -0.068061 -0.0648048 0.1132141 -0.0386419 0.0748845 -0.0394688 -0.0265371 0.0251274 0.0076177 0.0813367 0.0173108 -0.0912894 0.0021749 -0.0579758 0.0048437 0.0586852 -0.0688311 0.0238244 -0.0665237 -0.0212989 0.0398414 0.0254399 0.0447661 0.1565121 0.0031403 0.0973719 -0.0007944 0.1118657 -0.015807 0.0211259 0.0086912 0.0202527 0.1657505 0.0379548 -0.0548835 -0.0712846 0.1252235 -0.0821029 -0.1216803 -0.0293915 -0.1067149 -0.0383119 0.0502597 -0.0002715 0.0395522 0.1527168 -0.0075648 0.0763424 -0.060716 0.0991401 -0.1312788 -0.1424442 -0.0331804 0.0424097 -0.0794103 0.071619 0.021514 0.0547333 0.0147431 0.1131903 0.0268541 0.1550885 0.0439067 0.1462146 -0.0191885 -0.1042573 -0.0052944 -0.0433636 0.0075565 unknown
polarizability: 158.4591159|-6.8796199|95.0497313|1.8717053|-4.3612116|68.1776565 unknown
InChI: InChI=1S/C8H10OS/c1-9-8-4-2-7(6-10)3-5-8/h2-5,10H,6H2,1H3
charge 0 multiplicity 1
20 atoms
S  -3.9352 0.004652 -0.948682
O  2.777171 0.422204 -0.300221
C  -1.3843 -0.065803 0.394685
C  -0.803785 1.195176 0.080543
C  -0.530803 -1.19162 0.475099
C  1.41635 0.182421 -0.057861
C  -2.866493 -0.205284 0.635682
C  0.576326 1.324055 -0.141411
C  0.862376 -1.08327 0.251684
C  3.68805 -0.722385 -0.23685
H  -1.449046 2.077271 -0.003611
H  -0.954417 -2.173693 0.720113
H  -3.119063 -1.182269 1.077263
H  -3.261888 0.589687 1.2898
H  1.029765 2.290334 -0.382512
H  1.490706 -1.976006 0.324672
H  3.421915 -1.491252 -0.988326
H  3.694553 -1.177378 0.772972
H  4.682704 -0.31148 -0.463847
H  -3.273323 -0.95926 -1.691793
