program: Gaussian 09
title: 000080420
version: EM64L-G09RevD.01
frameworkgroup: C1[X(C14H20O3)]
method: RPBEPBE
basis: SDD
operation: Freq
keyword: #pfreq=noraman
keyword: PBEPBE/SDD
title: #p freq=noraman PBEPBE/SDD
converged: YES YES NO NO
title: Mulliken charges:
elementType: O O O C C C C C C C C C C C C C C H H H H H H H H H H H H H H H H H H H H
charge: -0.301410 -0.221564 -0.384935 -0.369194 -0.371541 -0.351315 -0.396253 -0.355799 -0.271011 -0.695535 0.201853 0.106163 0.189997 -0.299519 -0.396795 -0.249567 -0.194497 0.190730 0.191267 0.193510 0.193522 0.188634 0.188257 0.210584 0.209627 0.194961 0.195244 0.225244 0.225576 0.210062 0.215644 0.210161 0.279582 0.219079 0.232993 0.231539 0.354706
chargesum: 0.00000
title: Mulliken charges with hydrogens summed into heavy atoms:
elementType: O O O C C C C C C C C C C C C C C
charge: -0.301410 -0.221564 -0.030229 0.012803 0.015491 0.025576 0.023957 0.034406 0.179810 -0.059668 0.201853 0.106163 0.189997 -0.019937 -0.177715 -0.016574 0.037042
polarizability: 2.34219525e+02 -6.94715260e+00 1.68250101e+02 1.49947499e+00 5.67023703e-01 9.62747125e+01
1716.lowfreq: -8.3276 -0.0009 -0.0006 0.0007 1.0110 4.3250 14.5727 21.8537 31.0756
frequency: 11.3085 21.5393 30.9969 40.2429 61.8884 84.8970 93.9938 108.3641 126.9331 140.6323 164.5698 175.3783 184.0039 228.7352 250.3532 258.8681 333.1163 350.9848 384.0857 404.8526 436.8262 437.6700 468.3190 520.6023 524.8199 552.3171 649.7422 672.7678 722.2761 735.0758 756.1998 765.9662 769.0279 771.9927 821.6671 827.0398 851.1491 890.0029 912.9508 917.1400 956.7498 989.5580 1000.6337 1002.7504 1020.4288 1032.8842 1042.1865 1061.9865 1079.6415 1088.1362 1099.0134 1125.8912 1151.9262 1159.7891 1174.4669 1191.6745 1221.1191 1228.6077 1233.1892 1252.8805 1267.2367 1276.7677 1280.5646 1290.4467 1295.8291 1296.4570 1321.4596 1351.8307 1357.6360 1374.2661 1389.2013 1395.7783 1428.8969 1462.3920 1464.0176 1468.0646 1472.5704 1476.8732 1479.1205 1486.0647 1489.3317 1489.9361 1593.1122 1607.7759 1631.2063 2951.9281 2953.8463 2960.8011 2968.2062 2971.5445 2986.2519 2986.7529 2996.8279 2997.9399 3015.1432 3032.5091 3042.6641 3067.9602 3070.2377 3070.5538 3111.0211 3142.9469 3163.2760 3187.1940 3545.5138
redmass: 4.2040 2.8896 4.6231 2.6055 3.7707 1.7189 3.8735 3.4936 2.0295 2.2197 5.3741 3.4592 3.9930 1.1260 4.5242 5.1866 4.7137 3.8441 8.0183 1.1881 3.1323 3.6637 3.0066 4.3584 3.4886 7.7840 6.6905 4.3028 1.0636 1.0867 2.2544 1.4840 1.3531 7.3504 7.3877 1.1879 1.4915 1.8958 1.2020 7.5882 1.3582 1.3362 1.1626 4.0348 6.8020 3.3688 2.2115 3.0032 2.1395 2.3179 2.0595 2.9052 1.4858 1.2249 1.0622 1.5766 2.8127 1.4183 1.3328 2.9003 1.1699 1.3130 1.0901 1.0886 1.4485 1.1043 1.3628 1.5026 1.6509 1.5694 1.2174 6.8347 2.3573 1.0736 1.0744 1.0740 1.0758 1.0431 1.0770 1.0895 1.6738 1.4019 6.7925 6.6658 10.5066 1.0590 1.0589 1.0591 1.0587 1.0366 1.0597 1.0972 1.0571 1.0998 1.1031 1.1040 1.1047 1.1010 1.1072 1.0993 1.0889 1.0895 1.0957 1.0963 1.0657
irintensity: 0.9597 0.0346 0.8733 0.9241 0.2602 1.2259 1.0206 1.7062 0.1619 0.0343 1.5712 2.9335 1.4592 0.0061 0.5517 2.1018 2.1164 12.5099 3.3418 119.0818 7.4615 6.9773 3.3671 5.9631 16.2758 7.1823 7.3972 21.5314 13.4884 0.1169 60.9109 16.4841 18.7846 1.7077 48.4221 0.6014 0.1390 2.2225 0.2770 2.3721 1.6568 0.2687 0.9035 12.2400 350.2599 37.7069 6.7127 32.0168 1.4703 26.6544 135.3832 1.0407 0.7891 45.1044 13.0053 0.5485 293.6317 91.6106 0.0259 10.8301 0.4034 6.7767 0.0539 0.4271 56.3033 0.3404 0.9453 1.0370 0.4102 1.1566 10.9309 14.1498 28.0340 0.0290 0.0369 1.0652 0.2016 12.2937 4.3141 0.0040 50.1311 2.9706 29.8118 30.4343 238.4807 0.4654 0.3264 15.6837 115.8789 36.9351 18.9027 0.1511 46.0282 1.0265 0.3419 39.9638 43.0943 56.3803 122.6649 54.6226 13.4265 10.8865 18.0494 7.1172 27.4432
temp: 298.150 k
press: 1.00000 atm
elementType: 8 8 8 6 6 6 6 6 6 6 6 6 6 6 6 6 6 1 1 1 1 1 1 1 1 1 1 1 1 1 1 1 1 1 1 1 1
symmnumber: 1
zpe: 814912.7 jmol-1
zpe.correction: 0.310384 hartree
zpe.thermalcorrener: 0.329089 hartree
zpe.thermalcorrenthalpy: 0.330033 hartree
zpe.thermalcorrgfe: 0.259492 hartree
zpe.sumelectzpe: -769.853126 hartree
zpe.sumelectthermal: -769.834422 hartree
zpe.sumelectthermalent: -769.833477 hartree
zpe.sumelectthermalfe: -769.904018 hartree
dipole: -1.2728 2.2637 -0.1012
dipole: 2.5990
quadrupole: -70.5558 -105.1766 -104.4890
quadrupole: -3.6252 0.8227 0.6945
quadrupole: 22.8513 -11.7694 -11.0819 -3.6252 0.8227 0.6945
hfenergy: -770.1635102 hartree
pointgroup: C01 [X(C14H20O3)]
dipole: -0.5109199 0.8838304 -0.0580568 debye
polarizability: 234.3640457|-6.1496252|168.0936988|1.9068424|-0.8230919|96.2865946 unknown
InChI: InChI=1S/C14H20O3/c1-2-3-4-5-8-11-17-14(16)12-9-6-7-10-13(12)15/h6-7,9-10,15H,2-5,8,11H2,1H3
charge 0 multiplicity 1
37 atoms
O  -0.489656 -0.095171 -0.030187
O  -1.595188 -2.140668 0.083544
O  -4.34068 -1.988568 -0.079643
C  4.480558 0.508535 -0.075041
C  3.31413 -0.50169 0.007434
C  5.871356 -0.16102 -0.004232
C  1.925595 0.177432 -0.050489
C  7.040192 0.847088 -0.089072
C  0.793836 -0.848117 0.01978
C  8.426104 0.170901 -0.011892
C  -1.655742 -0.89103 0.014847
C  -2.879202 -0.038419 -0.025906
C  -4.192412 -0.60089 -0.064848
C  -2.759894 1.380024 -0.020103
C  -5.330446 0.247091 -0.093657
C  -3.888062 2.220354 -0.047685
C  -5.18145 1.646541 -0.084195
H  4.386317 1.245751 0.74956
H  4.398869 1.08616 -1.019468
H  3.402781 -1.085181 0.947552
H  3.405263 -1.232961 -0.82265
H  5.96643 -0.900567 -0.826856
H  5.954586 -0.736772 0.941465
H  1.830626 0.760891 -0.986761
H  1.822368 0.8931 0.78816
H  6.942402 1.587418 0.731296
H  6.958984 1.420075 -1.03545
H  0.821437 -1.437706 0.955653
H  0.820399 -1.557906 -0.828349
H  8.544164 -0.383376 0.938472
H  9.243631 0.912654 -0.073984
H  8.561556 -0.551349 -0.839112
H  -1.752415 1.80169 0.007617
H  -6.333766 -0.198541 -0.123943
H  -3.764724 3.30767 -0.040554
H  -6.071003 2.285544 -0.105708
H  -5.301943 -2.229788 -0.112795
