program: Gaussian 09
title: 000080395
version: EM64L-G09RevD.01
frameworkgroup: C1[X(C8H8O3)]
method: RPBEPBE
basis: SDD
operation: Freq
keyword: #p
keyword: freq=noraman
keyword: PBEPBE/SDD
title: #p freq=noraman PBEPBE/SDD
converged: NO YES NO NO
title: Mulliken charges:
elementType: O O O C C C C C C C C H H H H H H H H
charge: -0.414354 -0.406940 -0.303916 0.169691 0.045644 0.264581 0.181100 -0.358834 -0.368500 -0.848494 -0.186503 0.239091 0.259345 0.231145 0.305068 0.231291 0.202195 0.382719 0.375671
chargesum: 0.00000
title: Mulliken charges with hydrogens summed into heavy atoms:
elementType: O O O C C C C C C C C
charge: -0.031635 -0.031270 -0.303916 0.169691 0.045644 0.264581 0.181100 -0.119743 -0.109155 -0.080989 0.015692
polarizability: 1.50303908e+02 7.65037713e-01 1.08586626e+02 -2.81415543e-03 -1.21086154e-03 4.37563002e+01
1716.lowfreq: -8.0797 -4.5947 -0.0008 -0.0006 0.0002 8.6318 106.5422 119.2236 137.5555
frequency: 106.5341 119.2054 137.5547 234.9797 241.1392 278.7298 300.8588 351.6021 357.9291 405.5541 410.9993 487.7352 512.1930 523.2669 611.9696 629.3100 648.6827 747.7218 767.7444 806.2128 888.4865 931.2434 954.1089 972.3818 1017.8502 1042.1828 1076.1207 1136.7829 1171.7094 1233.5324 1268.8208 1316.3081 1342.2506 1376.2343 1398.2244 1414.8141 1430.9240 1455.9448 1481.6927 1490.9939 1569.4472 1596.5627 1646.0316 2723.3544 2960.3112 2979.2825 3030.0606 3109.2220 3132.9246 3185.2568 3561.9224
redmass: 1.9523 1.7061 3.7581 3.7811 4.9664 4.8437 3.6632 5.5899 2.9863 7.5834 1.1216 7.0875 3.4077 4.0014 6.8278 4.3795 5.9491 5.2219 5.3242 1.4379 2.4911 1.4805 1.2311 1.2760 2.7248 1.4610 1.8650 1.4993 1.7356 2.0378 3.3972 1.9781 1.9732 2.2113 1.2736 3.4601 2.9315 2.0647 1.6023 1.0442 3.5458 6.1743 4.0967 1.0744 1.0406 1.0892 1.0984 1.0934 1.0902 1.0955 1.0652
irintensity: 0.0372 0.0080 2.7352 3.9381 11.8032 1.2864 5.4515 11.3753 0.4381 0.6691 143.7624 10.6138 1.7111 0.1406 39.4193 3.3163 14.9089 2.1902 11.7135 42.7608 13.2863 4.9715 64.2375 84.7058 7.4279 3.3861 50.5086 302.9181 26.8712 75.3145 6.0860 45.5883 92.5261 166.6128 23.0839 69.9348 25.5947 80.9759 123.9781 18.4640 1.6546 127.9023 293.4597 292.1732 30.6196 58.4775 22.1610 0.3475 7.0900 3.6876 57.9302
temp: 298.150 k
press: 1.00000 atm
elementType: 8 8 8 6 6 6 6 6 6 6 6 1 1 1 1 1 1 1 1
symmnumber: 1
zpe: 374281.1 jmol-1
zpe.correction: 0.142556 hartree
zpe.thermalcorrener: 0.152437 hartree
zpe.thermalcorrenthalpy: 0.153381 hartree
zpe.thermalcorrgfe: 0.107780 hartree
zpe.sumelectzpe: -534.527884 hartree
zpe.sumelectthermal: -534.518003 hartree
zpe.sumelectthermalent: -534.517059 hartree
zpe.sumelectthermalfe: -534.562660 hartree
dipole: 2.8007 -0.9960 0.0001
dipole: 2.9726
quadrupole: -67.8031 -59.3096 -66.3070
quadrupole: 11.7617 0.0041 -0.0005
quadrupole: -3.3298 5.1636 -1.8338 11.7617 0.0041 -0.0005
hfenergy: -534.6704397 hartree
pointgroup: C01 [X(C8H8O3)]
dipole: 1.1085911 -0.372472 0.0031668 debye
dipolederiv: -0.7198706 0.3607601 -0.0014003 0.3035991 -0.9038311 0.0019871 -0.0013547 0.0019239 -0.3859991 -1.589336 -0.008873 -0.0027558 -0.1495425 -0.1450781 -0.0007866 -0.0027678 -0.0004697 -0.4019304 -1.1992715 0.075034 -0.001911 0.7201322 -0.6222828 0.0020679 -0.0027686 0.0008015 -0.36204 -0.5478005 0.4470497 -0.001729 0.377031 -0.0578223 0.0008106 -0.0015032 0.0010914 -0.1356606 0.8597035 -0.539814 0.0028769 -0.0750474 0.6837996 -0.0015187 0.0017479 -0.0024637 0.1239862 -1.2645444 -0.1363394 -0.0022829 -0.0282794 -0.3429426 0.0006697 -0.0021115 0.0003653 -0.0389682 1.5309452 -0.0024225 0.0034165 0.2028497 0.4615555 -0.0001981 0.0031645 -0.0006941 0.1032368 0.660698 0.040738 0.0017011 -0.3344767 0.0817118 -0.0010389 0.0025252 -0.0001973 -0.1152955 -0.5899986 -0.1695012 -0.0005643 -0.4626821 -0.155943 -0.0011026 -0.0000832 -0.0004261 -0.2024192 -0.0395251 -0.0269453 -0.0004582 -0.0017036 -0.1064403 0.000441 -0.0006006 0.0003301 0.1085816 1.8103285 -0.0179031 0.0032531 -0.3505579 0.6282489 -0.0021078 0.0034139 -0.0013839 0.0901715 0.0516905 -0.1025973 -0.000053 -0.0470844 -0.0433854 0.0002209 -0.0002155 0.000116 0.1558977 0.0401427 0.0739867 -0.0004368 0.0608651 0.0000251 0.0004387 -0.0003952 0.0004429 0.1794105 -0.0139833 -0.0829694 0.1156159 -0.0291401 0.0505014 -0.0178125 0.1121876 0.0350081 -0.0431203 0.0889242 0.1376849 -0.0004709 0.0252341 0.0581968 0.0002654 -0.000179 0.0005578 0.1310913 -0.0124034 -0.0832322 -0.1149386 -0.0298359 0.0504018 0.0171542 -0.1118146 -0.0359156 -0.0444896 0.0368384 -0.0321872 -0.0000185 -0.1613318 -0.186778 0.000465 0.000214 0.0007347 0.120227 0.4671816 0.0922235 -0.0000496 -0.0391747 0.4389784 -0.0004148 0.0002857 -0.0001763 0.3617071 0.4302808 -0.0246923 0.0002054 0.0191454 0.1110844 0.0004595 0.0002548 0.0003549 0.3556131 unknown
polarizability: 150.2637116|1.4968097|108.626104|0.2311054|-0.1153042|43.7570183 unknown
InChI: InChI=1S/C8H8O3/c1-5-7(10)3-2-6(4-9)8(5)11/h2-4,10-11H,1H3
charge 0 multiplicity 1
19 atoms
O  -1.176145 1.808692 -0.0101
O  3.137484 -0.421442 0.004577
O  -3.264525 0.342787 -0.01079
C  0.994879 0.772906 -0.002724
C  -0.418659 0.659463 -0.006111
C  -1.06339 -0.633714 -0.005258
C  1.740478 -0.433467 0.001114
C  -0.257291 -1.811398 -0.001165
C  1.134371 -1.72306 0.001893
C  1.671507 2.128118 -0.003295
C  -2.508225 -0.703754 -0.007318
H  -0.748031 -2.791859 -0.000575
H  1.779012 -2.605063 0.004841
H  2.305589 2.277967 -0.900066
H  0.907045 2.919771 -0.007431
H  2.29963 2.281596 0.897037
H  -2.980334 -1.708405 -0.005269
H  -2.174631 1.522057 -0.012076
H  3.485736 0.506103 0.003815
