program: Gaussian 09
title: 000080384
version: EM64L-G09RevD.01
frameworkgroup: C1[X(C8H9N3O)]
method: RPBEPBE
basis: SDD
operation: Freq
keyword: #pfreq=noraman
keyword: PBEPBE/SDD
title: #p freq=noraman PBEPBE/SDD
converged: NO NO NO NO
title: Mulliken charges:
elementType: O N N N C C C C C C C C H H H H H H H H H
charge: -0.268614 -0.483544 -0.097196 -0.613926 0.355792 0.015285 -0.501128 0.344887 -0.304024 0.102773 -0.362543 -0.537069 0.239958 0.296843 0.243818 0.246023 0.340507 0.309812 0.214446 0.243460 0.214440
chargesum: 0.00000
title: Mulliken charges with hydrogens summed into heavy atoms:
elementType: O N N N C C C C C C C C
charge: -0.268614 -0.186702 -0.097196 0.036393 0.355792 0.015285 -0.261169 0.344887 -0.060206 0.102773 -0.116520 0.135277
polarizability: 1.77903502e+02 6.39018763e+00 1.12326862e+02 -5.27753752e-03 -1.15215618e-03 5.04821229e+01
1716.lowfreq: -79.4583 -0.0011 -0.0007 -0.0005 3.0523 4.6284 13.4343 78.6897 116.9226
frequency: -79.4583 78.2793 116.9208 180.0635 202.9415 241.9490 286.2665 295.2238 380.0871 400.2645 415.2529 432.4815 459.3964 512.0760 517.7142 575.2187 619.9708 681.2277 688.5336 746.9832 753.7408 816.0039 824.3531 837.1194 926.0200 946.6109 956.1705 997.7919 1035.4195 1109.4681 1113.5944 1147.1977 1164.5154 1212.4037 1245.2667 1283.4827 1297.2768 1384.7096 1402.1802 1433.8590 1464.6076 1466.2263 1480.0283 1484.4155 1573.8616 1593.1581 1634.0359 1652.6740 2942.0961 3022.4997 3114.7102 3153.3953 3154.7518 3174.8122 3580.7530 3599.0290 3727.5192
redmass: 1.1948 3.3267 4.4453 3.4745 3.2613 1.4185 3.4375 2.9093 3.8569 5.6307 1.2947 2.7255 4.1093 1.1961 3.7937 5.6942 3.3771 8.1988 6.4036 6.1812 2.7579 1.6597 1.7165 5.2658 3.7955 1.3387 3.4214 3.8001 2.2999 1.4386 1.2619 1.5828 1.7765 3.3041 1.5068 3.1559 1.9583 4.4500 4.5759 1.2747 1.0505 2.5461 1.2181 3.5421 2.4487 2.8255 3.2304 4.4730 1.0339 1.1031 1.0980 1.0880 1.0912 1.0972 1.0454 1.0806 1.1049
irintensity: 95.8997 2.7190 1.1757 1.5324 23.9155 4.7266 8.8636 0.4888 27.2571 0.0613 184.0939 39.0294 6.2954 117.5167 0.1158 18.7622 10.5294 0.0838 7.1697 18.3595 1.7962 1.0591 99.9786 0.5307 6.5670 0.0996 1.2907 42.2656 1.9752 9.7705 0.2527 60.7715 90.4097 41.1223 50.4242 13.8715 1.3750 27.4697 98.8109 32.8649 12.0514 144.8176 3.3967 85.4652 84.6896 39.7375 98.5355 492.4302 73.0029 60.4410 28.7210 7.7312 7.2790 9.1369 121.1178 27.8389 42.5968
temp: 298.150 k
press: 1.00000 atm
elementType: 8 7 7 7 6 6 6 6 6 6 6 6 1 1 1 1 1 1 1 1 1
symmnumber: 1
zpe: 427883.9 jmol-1
zpe.correction: 0.162972 hartree
zpe.thermalcorrener: 0.173057 hartree
zpe.thermalcorrenthalpy: 0.174001 hartree
zpe.thermalcorrgfe: 0.127681 hartree
zpe.sumelectzpe: -548.861083 hartree
zpe.sumelectthermal: -548.850998 hartree
zpe.sumelectthermalent: -548.850054 hartree
zpe.sumelectthermalfe: -548.896375 hartree
dipole: -1.7820 -5.8819 0.0005
dipole: 6.1459
quadrupole: -53.2051 -58.8706 -75.2524
quadrupole: 5.6285 0.0025 -0.0002
quadrupole: 9.2376 3.5721 -12.8097 5.6285 0.0025 -0.0002
hfenergy: -549.0240554 hartree
pointgroup: C01 [X(C8H9N3O1)]
dipole: 0.7284467 2.3056508 0.0001774 debye
dipolederiv: -1.620016 0.4554055 0.0000053 0.5279199 -0.5289467 -0.0000031 -0.0001251 -0.0000261 -0.3003603 -0.83287 -0.0535572 -0.0000255 -0.0240808 -0.4906561 0.0000299 -0.0000328 0.0000195 -0.3140059 -0.9580253 -0.1513262 -0.000028 -0.5310329 -0.6477161 -0.0000323 -0.0000144 0.0000017 -0.2901889 -1.7354759 -0.4172611 -0.0000829 -0.493153 -0.3335715 -0.0000948 -0.0002348 -0.0001405 -0.7677356 0.3108718 0.1254012 0.0000125 0.6542176 0.2563717 0.0000214 0.0000124 0.0000024 0.0781184 0.6985278 0.134633 0.0000362 -0.2580902 -0.2090822 -0.0000146 0.000033 0.0000017 -0.027906 -0.2153393 0.0707116 0.0000104 -0.1480445 -0.0633647 0.0000065 -0.0000372 0.0000107 -0.2621663 1.3900685 -0.3557255 0.0000206 -0.4239736 0.1515555 -0.0000682 0.0001636 -0.0000527 0.0816232 0.2309202 0.1122786 0.0000279 -0.0251526 0.1526672 -0.0000034 0.0000187 0.000005 -0.1485058 1.9301689 0.2738183 0.0001179 0.5683528 0.932822 0.0000458 0.0001396 0.0000462 0.2027748 -0.3737541 -0.0183551 0.0000016 0.4255078 -0.0383083 0.0000196 0.0000261 -0.0000065 -0.2144075 0.4298704 -0.1327164 -0.0000173 -0.5527965 0.5683987 0.0000045 -0.0000708 0.0000273 0.3456166 0.0681933 0.0453441 -0.0000087 0.0731209 -0.0779899 0.0000019 -0.0000129 0.0000018 0.1913337 0.1419334 0.0194296 -0.000013 0.0169835 0.1233352 -0.0000068 -0.0000183 -0.0000191 0.3612458 0.078797 0.0629378 -0.0000037 0.0372137 -0.0690758 0.0000022 -0.0000079 0.0000034 0.1622157 -0.0023901 -0.0961009 -0.000009 -0.0882788 0.0196391 -0.0000018 -0.0000006 0. 0.1760726 0.280319 -0.0071297 0.0000032 -0.0585249 0.1542437 0.0000053 0.0000388 0.0000062 0.4032745 0.2094911 0.0292124 -0.0000123 0.0775362 0.1564311 0.0000383 0.0000739 0.0000777 0.4103775 0.0757175 -0.0675999 -0.0958025 0.1115901 -0.0701993 -0.0911076 -0.0207004 -0.1129781 -0.1040463 -0.1827374 0.0382074 0.0000335 -0.0009265 0.0837573 0.0000008 0.0000313 0. 0.1206682 0.0757292 -0.0676077 0.0957338 0.1116117 -0.0703108 0.0911564 0.0207178 0.1130195 -0.1039982 unknown
polarizability: 178.0456869|5.6116191|112.1846769|0.0052908|0.0010896|50.4821229 unknown
InChI: InChI=1S/C8H9N3O/c1-12-5-2-3-6-7(4-5)11-8(9)10-6/h2-4,11H,9H2,1H3
charge 0 multiplicity 1
21 atoms
O  -3.288374 0.069447 -0.000316
N  1.602608 1.295556 -0.000023
N  2.259872 -0.903885 0.000009
N  3.991423 0.779822 0.000139
C  0.409565 0.54141 -0.000081
C  0.843525 -0.826439 -0.000065
C  -0.945575 0.92624 -0.000164
C  -1.893042 -0.129476 -0.000213
C  -0.127124 -1.852791 -0.000121
C  2.670889 0.373421 0.00004
C  -1.489172 -1.495635 -0.000199
C  -3.772373 1.444332 0.000058
H  -1.249668 1.977234 -0.000178
H  1.671165 2.310871 0.000029
H  0.178931 -2.903185 -0.000097
H  -2.272591 -2.259359 -0.000232
H  4.703213 0.055704 0.00016
H  4.267365 1.755718 -0.000002
H  -3.439332 1.994338 0.904126
H  -4.870334 1.36882 0.000177
H  -3.43957 1.994756 -0.903847
