program: Gaussian 09
title: 000080390
version: EM64L-G09RevD.01
frameworkgroup: C1[X(C9H10O3)]
method: RPBEPBE
basis: SDD
operation: Freq
keyword: #pfreq=noraman
keyword: PBEPBE/SDD
title: #p freq=noraman PBEPBE/SDD
converged: YES YES NO NO
title: Mulliken charges:
elementType: O O O C C C C C C C C C H H H H H H H H H H
charge: -0.403606 -0.423592 -0.337458 0.379019 0.501968 -0.006176 0.127094 -0.529567 -0.547929 -0.780417 -0.814282 0.155546 0.239290 0.274182 0.243807 0.243789 0.211555 0.229685 0.227696 0.229858 0.389690 0.389850
chargesum: 0.00000
title: Mulliken charges with hydrogens summed into heavy atoms:
elementType: O O O C C C C C C C C C
charge: -0.013916 -0.033743 -0.337458 0.379019 0.501968 -0.006176 0.127094 -0.290277 -0.273747 -0.081267 -0.127043 0.155546
polarizability: 1.48039022e+02 1.31475011e-01 1.32321562e+02 -4.06711790e-03 -8.15979131e-03 5.33754927e+01
1716.lowfreq: -8.2975 -0.0009 -0.0001 0.0004 4.8939 9.0311 65.1369 84.3846 107.4895
frequency: 65.1324 84.3811 107.4876 132.1062 160.3764 191.4499 212.5649 256.3697 335.7825 349.6684 365.9577 431.5015 452.8369 457.7970 516.5754 566.1505 586.3213 593.8435 633.7873 696.8811 770.4089 771.7584 850.2784 888.5445 896.2614 926.4379 963.7927 991.3800 1021.6208 1047.1093 1055.4838 1076.3261 1153.4614 1217.3349 1247.5476 1284.7380 1323.2458 1396.7054 1399.4248 1401.5793 1412.3827 1423.2477 1441.6005 1454.1041 1470.6768 1478.7259 1485.8938 1576.5025 1608.8568 1644.6626 2976.1632 2985.6667 3026.7401 3052.7601 3065.0171 3086.5660 3094.5234 3114.5840 3160.4154 3529.2201
redmass: 1.0695 4.6820 1.0715 5.2683 4.3780 4.7172 3.1366 2.5872 3.9236 4.4414 6.6284 9.7472 5.8339 3.2237 4.2804 2.8836 1.2428 4.0518 4.6153 5.3649 5.2297 4.8713 1.0823 1.3926 5.1259 1.3565 4.5829 1.7015 1.4577 1.5086 1.5680 2.2212 1.6434 1.8009 2.5061 2.7542 2.1862 3.0297 1.3513 1.4121 2.2771 2.6176 3.2852 1.0449 1.0453 1.1325 1.3237 6.1222 4.1528 5.2272 1.0375 1.0364 1.0685 1.0978 1.0968 1.0984 1.1007 1.0916 1.0923 1.0640
irintensity: 0.1907 0.7572 0.1118 2.7236 0.7937 0.5770 1.7467 2.7369 2.6253 1.0588 11.5258 3.6362 3.1361 2.2986 12.7024 16.0867 143.4013 4.4242 42.6379 3.1108 11.3775 13.3997 159.2038 6.6645 13.8259 0.6800 6.0142 45.9695 9.2291 0.1091 19.4779 346.5043 76.2631 14.8457 39.7745 20.7951 178.7395 50.7643 7.2883 8.6301 113.0868 91.8490 80.3650 13.2427 13.0840 12.1627 39.2205 149.5016 15.4284 124.3612 43.0140 27.7931 261.4841 21.6903 14.9004 15.6772 14.1290 18.6011 2.1805 66.4373
temp: 298.150 k
press: 1.00000 atm
elementType: 8 8 8 6 6 6 6 6 6 6 6 6 1 1 1 1 1 1 1 1 1 1
symmnumber: 1
zpe: 448412.5 jmol-1
zpe.correction: 0.170791 hartree
zpe.thermalcorrener: 0.182414 hartree
zpe.thermalcorrenthalpy: 0.183358 hartree
zpe.thermalcorrgfe: 0.133241 hartree
zpe.sumelectzpe: -573.778208 hartree
zpe.sumelectthermal: -573.766585 hartree
zpe.sumelectthermalent: -573.765641 hartree
zpe.sumelectthermalfe: -573.815758 hartree
dipole: -1.2157 -2.0687 0.0005
dipole: 2.3995
quadrupole: -60.3619 -69.6241 -72.4683
quadrupole: -5.5626 -0.0056 -0.0018
quadrupole: 7.1229 -2.1393 -4.9835 -5.5626 -0.0056 -0.0018
hfenergy: -573.9489989 hartree
pointgroup: C01 [X(C9H10O3)]
dipole: -0.4488554 0.8297662 0.0347751 debye
dipolederiv: -0.69232 0.4933862 0.0213753 0.3144815 -0.9840087 -0.0251802 0.015132 -0.0275773 -0.375563 -0.6829579 -0.480219 -0.0131715 -0.7350619 -1.0340051 -0.0118832 -0.0220535 -0.0152789 -0.4130404 -1.1442809 0.2063043 0.0176524 0.2931273 -0.7990505 -0.0192063 0.0209147 -0.0179817 -0.3622579 -0.1439889 0.5681717 0.0211954 0.1994412 0.1788657 0.0048985 0.0082412 0.0001368 -0.0347251 -0.1674721 -0.4267222 -0.0131859 -0.3767888 0.0410758 0.0078518 -0.0106594 0.0076578 -0.0449843 0.5595089 -0.7520641 -0.0329099 -0.1544394 0.6876053 0.0239494 -0.0119679 0.031788 0.0508145 -1.0635987 -0.2737814 0.0043282 0.075492 -0.1804632 -0.0063267 0.0164896 -0.0016431 -0.0241434 0.1362087 0.0168768 -0.0031155 0.1646711 0.1286842 0.007901 0.0020618 0.0101578 -0.1612129 0.3152867 0.2746377 0.0035894 -0.274576 -0.1240029 0.0039555 -0.0158041 -0.0033698 -0.1330685 0.1048422 -0.0117823 -0.0009857 -0.0696349 -0.1676643 -0.0070052 -0.0029105 -0.0076111 0.0551981 -0.0320181 0.1041164 0.0050644 0.0662195 -0.002218 -0.0035706 0.0026387 -0.0031019 0.0761552 2.1429715 0.3001377 -0.0148859 0.3232747 1.3466241 0.0340901 -0.014183 0.0344222 0.2489617 -0.1149913 -0.0231139 0.002482 -0.0248004 0.0978477 -0.0011088 0.0024561 -0.0011634 0.1373689 0.1021355 -0.0440379 -0.0007854 -0.0332655 -0.0176593 -0.0056647 -0.0003901 -0.0055814 0.1551481 0.076635 0.0036253 0.068401 -0.0226937 0.0134678 -0.073638 0.0201648 -0.1111466 -0.0381331 0.0744147 0.011097 -0.0703857 -0.0193688 0.0001689 0.0768946 -0.024202 0.1136889 -0.0228609 -0.159518 -0.0530887 0.0013168 0.0655391 0.0719549 -0.0019497 0.0054832 -0.0005473 0.1050938 -0.0102435 0.0602814 0.1135695 0.0301286 0.0455633 0.0282487 0.138811 -0.0385994 -0.0485627 0.0150845 -0.1535329 -0.0050224 -0.031877 -0.0832145 -0.0071523 -0.0001209 -0.0057884 0.1082608 -0.0149981 0.0699104 -0.109194 0.0409468 0.0440509 -0.0217607 -0.1367361 0.0441675 -0.0428551 0.4758867 0.017348 -0.0009292 -0.0063964 0.4178776 0.0018757 -0.0018477 0.0014906 0.3640677 0.2234129 0.0924495 0.0055967 0.1755811 0.3185004 -0.0052189 0.008482 -0.0041194 0.4003386 unknown
polarizability: 147.9930273|-0.6481887|132.2544524|-1.2746307|2.759501|53.4885966 unknown
InChI: InChI=1S/C9H10O3/c1-5-3-6(2)8(10)7(4-5)9(11)12/h3-4,10-11H,1-2H3
charge 0 multiplicity 1
22 atoms
O  0.832843 -2.194941 -0.120613
O  2.698993 1.623035 -0.012746
O  2.933817 -0.676672 -0.096322
C  -1.329768 -1.152764 -0.056103
C  -1.515373 1.334124 0.033653
C  0.091522 -1.029118 -0.070448
C  0.701393 0.26925 -0.033294
C  -2.093438 0.027742 -0.004629
C  -0.116337 1.435757 0.018712
C  -1.956209 -2.528971 -0.09645
C  -2.403599 2.564446 0.088108
C  2.160371 0.342416 -0.050323
H  -3.187651 -0.064048 0.006431
H  0.374666 2.413246 0.046507
H  -1.644426 -3.078926 -1.003132
H  -1.623407 -3.140678 0.761931
H  -3.057332 -2.466284 -0.081097
H  -3.05313 2.553983 0.983747
H  -1.806028 3.491297 0.118052
H  -3.068679 2.621614 -0.79436
H  1.822011 -1.943592 -0.12462
H  3.69126 1.553584 -0.028403
