program: Gaussian 09
title: 000080432
version: EM64L-G09RevD.01
frameworkgroup: C1[X(C17H16O2)]
method: RPBEPBE
basis: SDD
operation: Freq
keyword: #pfreq=noraman
keyword: PBEPBE/SDD
title: #p freq=noraman PBEPBE/SDD
converged: YES YES NO NO
title: Mulliken charges:
elementType: O O C C C C C C C C C C C C C C C C C H H H H H H H H H H H H H H H H
charge: -0.238796 -0.238781 -0.410012 -0.551728 -0.551678 0.134462 0.134445 0.284901 0.284922 -0.340580 -0.340564 -0.351898 -0.351922 -0.245068 -0.245085 -0.227888 -0.227884 -0.223538 -0.223542 0.217009 0.216980 0.283968 0.239553 0.239549 0.283967 0.252051 0.252063 0.276294 0.276282 0.230856 0.230854 0.232483 0.232484 0.232920 0.232922
chargesum: 0.00000
title: Mulliken charges with hydrogens summed into heavy atoms:
elementType: O O C C C C C C C C C C C C C C C C C
charge: -0.238796 -0.238781 0.023977 -0.028207 -0.028162 0.134462 0.134445 0.284901 0.284922 -0.088529 -0.088502 -0.075604 -0.075640 -0.014212 -0.014231 0.004595 0.004600 0.009382 0.009380
polarizability: 2.23977134e+02 -6.61929487e-03 1.45390114e+02 1.66163007e+01 -5.77003780e-03 1.84064021e+02
1716.lowfreq: -7.1729 -0.0009 -0.0004 -0.0002 3.5388 4.3066 15.8557 25.9644 31.5295
frequency: 15.8549 25.9588 31.4935 44.3079 63.5303 122.4890 130.6320 146.4272 163.5854 206.0953 211.6183 299.8088 305.2574 338.9663 400.2095 400.3361 406.6766 415.6017 422.6058 461.6692 465.9252 563.6275 577.0821 612.7016 613.4133 618.6328 654.0177 696.6163 697.3259 713.1294 762.8103 763.6101 772.9025 846.6329 859.8395 860.9900 876.8041 942.4779 943.0823 968.6416 989.6627 989.7009 991.9986 992.3047 992.5346 993.3183 1010.6462 1011.4416 1025.2999 1026.7905 1032.6814 1084.7591 1085.1220 1124.0743 1154.0286 1158.1029 1173.0590 1173.2743 1188.6538 1188.6987 1227.2786 1230.6607 1280.3961 1313.1440 1315.0044 1333.7044 1355.5807 1361.1574 1387.2552 1387.2633 1433.1129 1435.4924 1439.7404 1442.0988 1445.7594 1478.6983 1479.5302 1565.4645 1567.9054 1597.0159 1597.7387 1611.2877 1612.0535 2973.5933 2975.4384 3008.5022 3029.0333 3034.6718 3068.9569 3128.3809 3128.3992 3138.7623 3138.7701 3150.5400 3150.5811 3159.3753 3159.3845 3169.4435 3169.5253
redmass: 6.0884 4.0515 4.5132 5.8545 6.9337 5.2409 3.8062 5.2216 3.4268 3.1017 3.3079 2.6835 6.7572 4.8421 2.7954 2.8082 2.2887 3.1130 4.1951 4.8942 6.0900 2.2320 2.9174 5.8819 6.4269 4.0278 5.4716 1.8627 1.8173 3.3801 2.9377 1.6906 2.1701 2.0315 1.2582 1.2661 3.3408 1.4459 1.4791 3.8409 5.7832 5.7934 1.7910 1.3994 1.5130 3.2325 1.4182 1.3548 2.2247 2.0615 1.9430 1.5734 1.6060 2.6454 1.2039 1.1581 1.0651 1.0631 1.1359 1.1213 2.5727 2.4253 1.2970 1.4550 1.3513 1.9104 1.6493 1.3943 9.3383 9.2257 1.6595 2.1385 1.3609 1.1405 1.0897 2.2104 2.1826 6.6307 6.4325 6.5922 6.7325 6.2803 6.3708 1.0629 1.0634 1.0636 1.0948 1.0916 1.1025 1.0851 1.0851 1.0881 1.0881 1.0924 1.0923 1.0959 1.0959 1.1012 1.1012
irintensity: 0.6920 0.8356 1.8298 1.1998 4.7538 0.0498 4.8832 0.5760 0.2965 13.6482 5.3368 13.6124 1.9588 0.3343 0.0447 0.0183 0.5726 1.6784 0.1970 3.1677 10.6331 1.0183 5.0616 0.1318 0.0747 6.2347 14.5097 31.9635 61.7269 25.7648 32.6091 67.1301 44.1868 30.5532 0.0262 3.5035 15.4000 0.8764 2.2819 57.5153 0.1172 2.5087 7.7704 0.0264 1.2586 9.8728 3.1880 0.3160 3.5895 2.4957 3.9337 20.1993 1.3671 6.8531 9.1205 53.5934 1.8451 0.4863 23.6683 10.8712 154.8907 55.5502 40.6658 21.6106 0.0475 162.9121 34.8044 0.4261 0.7898 5.6355 34.6497 14.7398 68.3302 0.0670 18.0336 2.0839 0.2867 16.6540 158.1625 5.5869 60.2022 3.9802 12.3441 94.2731 3.9549 19.0683 3.6865 31.6796 12.0231 0.1306 0.0326 8.9654 5.5137 18.7108 10.3915 7.7679 38.2489 31.2245 10.8521
temp: 298.150 k
press: 1.00000 atm
elementType: 8 8 6 6 6 6 6 6 6 6 6 6 6 6 6 6 6 6 6 1 1 1 1 1 1 1 1 1 1 1 1 1 1 1 1
symmnumber: 1
zpe: 737439.4 jmol-1
zpe.correction: 0.280876 hartree
zpe.thermalcorrener: 0.297663 hartree
zpe.thermalcorrenthalpy: 0.298607 hartree
zpe.thermalcorrgfe: 0.233150 hartree
zpe.sumelectzpe: -806.514348 hartree
zpe.sumelectthermal: -806.497561 hartree
zpe.sumelectthermalent: -806.496617 hartree
zpe.sumelectthermalfe: -806.562073 hartree
dipole: -0.0002 -1.3318 -0.0004
dipole: 1.3318
quadrupole: -88.4439 -107.8020 -110.6152
quadrupole: -0.0028 9.7428 0.0003
quadrupole: 13.8432 -5.5150 -8.3282 -0.0028 9.7428 0.0003
hfenergy: -806.7952234 hartree
pointgroup: C01 [X(C17H16O2)]
dipole: 0.0048082 0.5239462 -0.0011327 debye
polarizability: 225.3816506|-0.7744134|145.3977932|-14.754906|0.2222727|182.6518257 unknown
InChI: InChI=1S/C17H16O2/c18-16(14-8-3-1-4-9-14)12-7-13-17(19)15-10-5-2-6-11-15/h1-6,8-11H,7,12-13H2
charge 0 multiplicity 1
35 atoms
O  1.465957 -0.956728 1.876464
O  -1.482366 -0.937719 -1.87165
C  -0.02271 -2.486483 0.006203
C  1.198934 -1.660583 -0.445639
C  -1.228528 -1.635599 0.453771
C  1.882356 -0.881928 0.679526
C  -1.897206 -0.84957 -0.675081
C  3.076447 -0.027739 0.346661
C  -3.075239 0.028213 -0.346218
C  3.561968 0.122712 -0.98088
C  -3.557759 0.193638 0.980641
C  3.739497 0.650515 1.406042
C  -3.725786 0.713755 -1.408649
C  4.686713 0.93472 -1.241076
C  -4.667367 1.027328 1.237167
C  4.862518 1.459796 1.146089
C  -4.833731 1.544708 -1.152352
C  5.339503 1.604259 -0.179745
C  -5.30788 1.703897 0.172816
H  0.271724 -3.136894 0.850324
H  -0.329232 -3.135554 -0.834646
H  0.896551 -0.968634 -1.255249
H  1.956163 -2.333474 -0.899032
H  -1.998442 -2.291958 0.910078
H  -0.913357 -0.945633 1.260188
H  3.064405 -0.386139 -1.812712
H  -3.069519 -0.320466 1.814758
H  3.350117 0.522207 2.421623
H  -3.33892 0.573733 -2.423646
H  5.053351 1.047536 -2.267184
H  -5.031793 1.151478 2.262757
H  5.367303 1.977784 1.968951
H  -5.328988 2.068142 -1.977549
H  6.212533 2.234435 -0.383806
H  -6.169216 2.350845 0.374054
