program: Gaussian 09
title: 000000434
version: EM64L-G09RevD.01
frameworkgroup: C1[X(C10H14N2O)]
method: RPBEPBE
basis: SDD
operation: Freq
keyword: #p
keyword: freq=noraman
keyword: PBEPBE/SDD
title: #p freq=noraman PBEPBE/SDD
converged: YES YES NO NO
title: Mulliken charges:
elementType: O N N C C C C C C C C C C H H H H H H H H H H H H H H
charge: -0.215895 -0.294407 0.005655 -0.394401 -0.505391 -0.347825 0.125356 0.273623 -0.626146 -0.266127 -0.451543 -0.180351 -0.338926 0.210644 0.239028 0.233627 0.236890 0.202419 0.168294 0.254481 0.222896 0.225010 0.188596 0.286013 0.261784 0.237853 0.248844
chargesum: 0.00000
title: Mulliken charges with hydrogens summed into heavy atoms:
elementType: O N N C C C C C C C C C C
charge: -0.215895 -0.039926 0.005655 0.055271 -0.034875 0.022889 0.125356 0.273623 0.010356 0.019886 -0.189759 0.057501 -0.090083
polarizability: 1.82473013e+02 4.80063453e+00 1.21143863e+02 -8.70871473e-04 5.17789197e-01 6.94287242e+01
1716.lowfreq: -6.1724 -2.3577 -0.0011 -0.0009 -0.0008 9.8711 30.6245 45.9877 59.4709
frequency: 30.6029 45.8541 59.4591 62.6879 112.8260 127.1972 156.3860 166.6077 218.7467 234.8869 283.3133 365.0999 380.0413 409.2351 423.9017 494.4847 571.0935 606.5153 640.2719 675.4986 716.2591 753.4215 784.1011 818.5498 871.3536 927.1522 953.3728 964.2715 979.6565 1004.5121 1010.8030 1026.4871 1047.2248 1067.5848 1080.7601 1102.2092 1107.3518 1132.4356 1166.8384 1188.8464 1200.1789 1225.6154 1263.2380 1277.6637 1282.6176 1311.1144 1330.8300 1346.5720 1378.3430 1405.3249 1432.5539 1436.1531 1450.3768 1460.9876 1466.4385 1470.3336 1488.3643 1498.3377 1544.4144 1575.9183 1600.4309 2819.7441 2867.6595 2955.4543 2980.6228 2999.1210 3004.9453 3011.1962 3069.2757 3075.1770 3134.6555 3138.8750 3152.5996 3171.8613 3450.3662
redmass: 4.0305 1.7696 4.0760 4.3455 2.5531 1.9146 3.4878 4.0434 4.0415 1.2559 4.5818 2.7474 4.2193 3.9080 4.3345 4.3399 2.4328 7.5892 1.4488 4.6884 1.9835 1.2025 5.3869 1.5053 1.4664 1.4096 3.0037 1.4615 3.0257 3.5690 1.3692 3.3097 2.2502 1.8971 2.1849 1.5800 1.2973 1.7373 3.3672 1.4485 1.4990 1.9945 1.2082 1.1668 1.5597 10.1514 1.3533 1.5694 1.5372 1.9951 1.1296 1.1497 1.1940 1.9940 1.0825 1.0794 1.0629 1.0694 5.5797 5.9782 8.4880 1.0717 1.0568 1.0605 1.0844 1.0782 1.0810 1.0748 1.1011 1.0991 1.0876 1.0919 1.0914 1.1002 1.0746
irintensity: 1.2159 2.9152 2.9840 2.5060 4.7359 1.9327 0.0642 2.3225 2.2557 1.5290 12.9112 1.0176 7.8750 0.8747 6.0318 8.7514 0.3375 0.8870 113.7832 14.8540 33.4320 23.2505 3.7607 30.9034 0.3007 0.7045 9.0900 0.5048 40.6198 6.8879 0.5884 9.4644 1.1396 4.8995 0.4890 13.3318 5.5948 14.4894 37.4313 2.3842 1.9781 57.9144 1.3287 27.4083 97.6351 3.0416 2.8545 74.8470 3.6039 32.3841 20.4269 1.5210 24.0593 2.0586 7.7000 8.1129 18.8645 5.5818 7.8843 80.4809 66.8753 112.8227 172.9015 32.9949 23.6323 13.7012 23.9094 52.2485 37.8329 39.7830 17.4754 10.9398 4.9470 21.9503 0.9085
temp: 298.150 k
press: 1.00000 atm
elementType: 8 7 7 6 6 6 6 6 6 6 6 6 6 1 1 1 1 1 1 1 1 1 1 1 1 1 1
symmnumber: 1
zpe: 586440.9 jmol-1
zpe.correction: 0.223364 hartree
zpe.thermalcorrener: 0.236807 hartree
zpe.thermalcorrenthalpy: 0.237752 hartree
zpe.thermalcorrgfe: 0.181377 hartree
zpe.sumelectzpe: -573.181202 hartree
zpe.sumelectthermal: -573.167758 hartree
zpe.sumelectthermalent: -573.166814 hartree
zpe.sumelectthermalfe: -573.223188 hartree
dipole: -0.2761 -0.6965 0.9959
dipole: 1.2463
quadrupole: -65.0317 -86.6809 -79.6243
quadrupole: -10.1384 4.9986 1.7244
quadrupole: 12.0806 -9.5686 -2.5120 -10.1384 4.9986 1.7244
hfenergy: -573.4045655 hartree
pointgroup: C01 [X(C10H14N2O1)]
dipole: -0.1139517 0.2850663 -0.3823221 debye
polarizability: 182.5911772|-3.9394954|120.9350572|-0.5875364|2.2038701|69.5193649 unknown
InChI: InChI=1S/C10H14N2O/c1-11-6-3-5-10(13)9-4-2-7-12-8-9/h2,4,7-8,11H,3,5-6H2,1H3
charge 0 multiplicity 1
27 atoms
O  -0.024634 -1.994544 -0.093543
N  4.803767 -0.128147 0.033809
N  -3.166212 1.709727 0.050079
C  2.343158 -0.456877 0.043732
C  0.968795 0.234025 -0.000413
C  3.49993 0.556701 -0.040989
C  -0.206332 -0.743517 -0.037004
C  -1.609077 -0.191677 -0.012778
C  5.975208 0.763991 -0.018867
C  -2.705246 -1.09565 -0.037731
C  -1.900162 1.198662 0.030782
C  -4.017703 -0.58713 -0.017307
C  -4.200719 0.816808 0.026666
H  2.412124 -1.18361 -0.7893
H  2.444747 -1.0453 0.973041
H  0.897107 0.895116 -0.891091
H  0.846581 0.904932 0.875316
H  3.439492 1.265314 0.810849
H  3.385305 1.173476 -0.972971
H  4.866402 -0.896439 -0.647172
H  6.902288 0.16489 0.016243
H  5.974545 1.426722 0.866929
H  6.018142 1.418662 -0.924991
H  -2.494877 -2.169692 -0.072181
H  -1.098143 1.944955 0.04995
H  -4.885325 -1.25387 -0.034597
H  -5.205763 1.253473 0.04404
