program: Gaussian 09
title: 000080328
version: EM64L-G09RevD.01
frameworkgroup: C1[X(C8H8OS)]
method: RPBEPBE
basis: SDD
operation: Freq
keyword: #pfreq=noraman
keyword: PBEPBE/SDD
title: #p freq=noraman PBEPBE/SDD
converged: YES YES NO NO
title: Mulliken charges:
elementType: S O C C C C C C C C H H H H H H H H
charge: 0.328134 -0.239742 -0.312263 -0.473930 -0.473714 0.298560 -0.247177 -0.250948 -0.140982 -0.515655 0.235435 0.243757 0.268057 0.268322 0.243670 0.248969 0.250219 0.269287
chargesum: 0.00000
title: Mulliken charges with hydrogens summed into heavy atoms:
elementType: S O C C C C C C C C
charge: 0.328134 -0.239742 -0.076827 0.037884 0.038278 0.298560 -0.247177 -0.001979 0.109236 -0.246368
polarizability: 1.54735246e+02 4.97857013e+00 1.03203234e+02 8.88747050e-02 -7.41435222e-02 5.53628836e+01
1716.lowfreq: -10.4209 0.0009 0.0018 0.0021 4.5324 8.8791 41.0739 57.6438 137.6697
frequency: 40.4599 57.6132 137.6661 169.7732 261.3496 266.2678 288.2253 441.2582 447.3770 562.0364 624.3059 680.6067 706.2181 718.0624 722.9740 787.6497 792.7499 809.4952 839.6029 845.5829 878.6606 918.4104 948.7518 1044.4260 1063.3046 1079.5752 1084.4719 1087.7567 1095.2843 1178.3885 1199.8127 1208.2773 1243.9009 1340.2688 1383.7791 1423.2960 1442.9865 1454.8016 1524.7880 1555.3747 3100.6346 3107.0651 3159.1969 3174.4571 3191.5932 3207.5896 3226.0877 3232.6631
redmass: 2.8439 5.4757 4.7548 5.0857 5.9174 2.9156 5.6842 8.6230 5.5065 2.9638 6.8794 5.3517 3.6312 2.8153 1.3925 1.3739 2.6063 2.4495 1.3047 4.5612 1.7433 1.3896 4.6253 1.2297 1.5155 1.1750 1.3694 1.2263 1.2180 1.3712 1.7396 3.3548 1.6486 2.3495 2.2349 1.0876 1.3714 6.2368 5.7798 7.3520 1.0500 1.0611 1.0914 1.0893 1.0974 1.1182 1.1160 1.1002
irintensity: 0.5321 1.8080 1.7592 0.0350 8.2299 0.4426 2.8026 2.7772 2.4403 0.5044 3.8638 1.3128 12.3429 55.9233 60.0251 0.6432 2.1634 17.4552 11.7742 4.3162 6.9207 0.0130 120.6495 5.8186 42.5157 14.8925 5.7522 0.0951 8.5484 0.2498 14.7591 10.9050 136.0443 3.7594 118.5440 12.1467 11.9715 99.4396 35.1335 117.4314 15.9227 11.3932 7.9118 5.5852 4.3722 0.4065 10.7108 0.7707
temp: 298.150 k
press: 1.00000 atm
elementType: 16 8 6 6 6 6 6 6 6 6 1 1 1 1 1 1 1 1
symmnumber: 1
zpe: 357413.5 jmol-1
zpe.correction: 0.136132 hartree
zpe.thermalcorrener: 0.145390 hartree
zpe.thermalcorrenthalpy: 0.146335 hartree
zpe.thermalcorrgfe: 0.100418 hartree
zpe.sumelectzpe: -782.161997 hartree
zpe.sumelectthermal: -782.152738 hartree
zpe.sumelectthermalent: -782.151794 hartree
zpe.sumelectthermalfe: -782.197710 hartree
dipole: 0.8982 3.9084 0.0211
dipole: 4.0103
quadrupole: -54.2701 -66.0225 -68.1650
quadrupole: -3.0285 -0.0126 -0.0660
quadrupole: 8.5491 -3.2033 -5.3458 -3.0285 -0.0126 -0.0660
hfenergy: -782.2981284 hartree
pointgroup: C01 [X(C8H8O1S1)]
dipole: 0.4536498 -1.3202946 -0.7351017 debye
dipolederiv: 0.0861963 0.0158904 0.015849 -0.0570412 -0.1414459 -0.1534233 -0.0205995 -0.1608847 0.0871805 -0.7953931 0.055723 0.0719823 0.117421 -0.6925106 -0.1988401 0.103291 -0.1897506 -0.4500581 -1.0706052 -0.2790044 -0.052515 -0.178447 -0.0582882 -0.0139545 -0.0036262 -0.0065453 -0.0056004 0.2357276 0.1070805 0.0155013 0.0437669 0.026736 0.0680284 -0.3077541 0.0318068 -0.0142771 0.2735781 0.0957331 0.0344255 -0.2076072 0.0364989 0.0519574 0.1689762 0.0567796 -0.0675003 1.9323389 0.0528353 -0.1316767 0.1671501 0.6689078 0.2354711 -0.0715509 0.2420011 0.3376249 -0.8290744 0.2864279 0.2098206 0.4890237 0.1325926 0.1029793 0.3135887 0.1224083 -0.1270064 0.3083989 0.0859186 0.0042651 -0.1945453 -0.1266905 0.0099921 -0.141979 -0.0165907 -0.1058874 -0.293201 -0.1457418 -0.0621551 -0.2647827 -0.1441119 0.0315552 -0.1219059 0.0203893 -0.1350508 -0.125984 -0.1094104 -0.0724591 0.1246748 0.1534521 0.215865 0.0483171 0.238332 -0.1725492 -0.0160831 0.0662728 0.0457908 0.0276498 -0.0303494 -0.0780283 0.0268888 -0.0812857 0.070699 -0.0131966 -0.0340862 -0.0930314 -0.0196721 0.0531246 -0.065748 -0.09139 -0.0393186 -0.0251508 0.0844119 -0.0159208 -0.0390914 0.0437515 -0.0443333 0.0346159 -0.014199 -0.0059339 0.0796346 0.0933769 -0.0421355 -0.0001159 0.0066381 0.0503028 -0.074841 0.0317043 -0.024637 -0.0219669 0.0089682 -0.0903172 0.033294 -0.0773853 -0.0609136 0.0454643 0.0458647 0.0214002 0.0673342 0.0847155 -0.0757489 -0.0292677 -0.1033978 0.0273477 -0.0701053 -0.0433984 -0.0725842 0.1498828 0.0381096 0.0557815 0.0438682 0.0935188 0.0347969 -0.0925816 0.0632703 -0.0890214 0.1464815 -0.0022843 -0.0292978 0.0055156 -0.0107161 0.1148841 -0.0484065 0.0145019 -0.046565 0.1862099 unknown
polarizability: 154.4857523|2.4720422|92.8550169|-7.9951238|19.1021466|65.9605946 unknown
InChI: InChI=1S/C8H8OS/c9-8(6-3-4-6)7-2-1-5-10-7/h1-2,5-6H,3-4H2
charge 0 multiplicity 1
18 atoms
S  1.935508 1.227022 0.65251
O  -1.063222 1.360028 1.019163
C  -1.745213 -0.716946 -0.006367
C  -3.123711 -0.164605 -0.459309
C  -3.008385 -0.862237 0.882999
C  -0.719254 0.285474 0.424517
C  0.699091 0.001182 0.141735
C  1.311729 -1.092247 -0.47779
C  2.740916 -0.987511 -0.56048
C  3.229927 0.189753 -0.004289
H  -1.38645 -1.618793 -0.507128
H  -3.616114 -0.679637 -1.288662
H  -3.2167 0.924747 -0.448485
H  -3.025855 -0.230476 1.775325
H  -3.420384 -1.868278 0.999245
H  0.754915 -1.949306 -0.863571
H  3.381196 -1.748961 -1.011722
H  4.264205 0.523492 0.067309
