program: Gaussian 09
title: 000080321
version: EM64L-G09RevD.01
frameworkgroup: C1[X(C8H7NS)]
method: RPBEPBE
basis: SDD
operation: Freq
keyword: #pfreq=noraman
keyword: PBEPBE/SDD
title: #p freq=noraman PBEPBE/SDD
converged: NO NO NO YES
title: Mulliken charges:
elementType: S N C C C C C C C C H H H H H H H
charge: 0.341444 -0.375216 0.353642 -0.366385 0.195213 -0.364378 -0.257508 -0.755847 -0.230567 -0.221388 0.244117 0.246637 0.259948 0.233091 0.233060 0.230999 0.233137
chargesum: 0.00000
title: Mulliken charges with hydrogens summed into heavy atoms:
elementType: S N C C C C C C C C
charge: 0.341444 -0.375216 0.353642 -0.366385 0.195213 -0.120261 -0.010871 -0.029748 0.000432 0.011749
polarizability: 1.41371078e+02 3.01867751e+00 1.23990814e+02 2.18638376e-03 1.23073354e-02 4.66064529e+01
1716.lowfreq: -4.4687 -1.7580 -0.0020 -0.0020 -0.0016 8.0821 122.9990 144.4541 196.5054
frequency: 122.9761 144.4443 196.5045 226.7340 260.3835 364.8322 421.0624 482.0314 485.2336 501.6722 524.3831 608.3032 664.5051 687.5679 732.0741 755.2254 768.2322 864.8108 951.1029 990.1902 992.3693 1019.0555 1026.7349 1038.2663 1094.8975 1135.3524 1176.1181 1264.8610 1345.7957 1388.0623 1396.3228 1407.0603 1440.7950 1451.9067 1465.1551 1489.7474 1570.6751 1599.7092 2985.7944 3066.4559 3118.7121 3133.4541 3143.1016 3157.3154 3170.7680
redmass: 1.0787 3.1086 5.2665 3.0890 4.9737 6.3310 3.0959 9.5351 4.5327 6.2200 5.8244 3.6863 7.6481 6.9861 2.6593 5.5431 1.5403 1.3526 1.3773 1.3241 1.7848 2.4748 5.1563 1.5130 2.9321 1.4993 1.0914 1.4942 3.1682 1.5545 4.7745 2.4230 1.6718 2.7834 1.0455 1.8889 6.4791 6.6385 1.0375 1.0981 1.0981 1.0855 1.0897 1.0952 1.1005
irintensity: 0.7850 0.8837 0.5143 1.9456 5.2669 0.2374 3.8080 1.9603 8.9848 8.1175 3.6171 4.3191 5.2533 11.9551 19.5054 0.0012 72.5514 0.3520 1.3489 0.0142 5.9602 9.4170 4.1226 2.3619 6.7980 3.7733 1.5004 2.8527 31.6786 17.8799 1.5830 12.0627 32.8834 1.9972 18.4213 3.9312 1.2193 14.8767 16.6529 16.4625 7.3948 0.0724 5.9917 18.3269 21.1811
temp: 298.150 k
press: 1.00000 atm
elementType: 16 7 6 6 6 6 6 6 6 6 1 1 1 1 1 1 1
symmnumber: 1
zpe: 333942.1 jmol-1
zpe.correction: 0.127192 hartree
zpe.thermalcorrener: 0.135568 hartree
zpe.thermalcorrenthalpy: 0.136512 hartree
zpe.thermalcorrgfe: 0.093854 hartree
zpe.sumelectzpe: -761.157421 hartree
zpe.sumelectthermal: -761.149045 hartree
zpe.sumelectthermalent: -761.148100 hartree
zpe.sumelectthermalfe: -761.190759 hartree
dipole: 2.7378 2.0202 0.0003
dipole: 3.4025
quadrupole: -64.2054 -57.6307 -69.2727
quadrupole: -5.1831 -0.0005 0.0019
quadrupole: -0.5025 6.0722 -5.5698 -5.1831 -0.0005 0.0019
hfenergy: -761.2846127 hartree
pointgroup: C01 [X(C8H7N1S1)]
dipole: 1.0111105 -0.877291 -0.0001203 debye
dipolederiv: -0.2556956 -0.2243952 -0.0000472 -0.0208796 -0.2489506 -0.0000618 0.000013 -0.0001071 0.1263795 -0.2867141 0.4498289 0.0001055 0.1919899 0.1671659 0.0000804 0.0000304 0.0001087 -0.3136005 -0.2658959 -0.2033491 -0.0000323 0.0469067 -0.27086 -0.000039 0.0000109 -0.0000593 0.0567231 0.2989598 -0.3798464 -0.0000743 -0.3380285 0.1164356 0.0000369 -0.0000872 0.0000481 -0.1189765 0.4385404 0.2134239 0.0000378 0.2005394 0.1611551 0.0000234 0.0000791 0.0000998 0.0316319 0.1298328 0.1106269 0.0000193 -0.0295759 0.0638785 0.0000413 0.000002 0.0000352 -0.1404816 -0.1527484 0.1861774 0.0000324 0.1880804 0.0208302 0.0000179 0.0000276 0.0000299 -0.1075351 -0.0099175 -0.0203688 0.000009 -0.1133164 -0.1405958 -0.0000596 -0.0000261 -0.0001249 0.0853033 -0.0804536 -0.167457 -0.000032 -0.119809 -0.0206776 0.0000182 -0.0000194 0.0000289 -0.1729155 0.0766901 0.0358873 0.0000022 -0.003354 0.1239594 0.0000435 0.000005 0.0000316 -0.1479142 0.0679027 -0.0761879 -0.0000099 -0.0394056 -0.0617631 -0.0000336 -0.000012 -0.0000303 0.1551807 0.070249 -0.0200467 -0.0000008 -0.0710712 -0.0506677 -0.0000325 -0.0000134 -0.0000363 0.1655556 -0.076493 -0.0050468 0.0001012 0.0913913 0.1109727 -0.0000409 0.0001154 0.0000101 0.1234826 0.0880103 0.0173582 0.0727991 -0.0332822 -0.0134415 -0.0816946 0.0293251 -0.0997473 -0.0335522 0.0879212 0.017554 -0.0729253 -0.0331629 -0.0135699 0.081741 -0.0294675 0.0997535 -0.033298 -0.0092997 0.1009116 0.0000176 0.1096975 -0.0293902 -0.00003 0.0000201 -0.0000298 0.1644611 -0.1208886 -0.0350703 -0.0000023 -0.0267199 0.085519 -0.0000105 -0.0000029 -0.0000107 0.159556 unknown
polarizability: 140.7883414|-4.3475228|124.5735508|-0.001209|0.0124414|46.6064529 unknown
InChI: InChI=1S/C8H7NS/c1-6-7-4-2-3-5-8(7)10-9-6/h2-5H,1H3
charge 0 multiplicity 1
17 atoms
S  -1.064865 2.135241 0.000274
N  -2.2825 0.764436 -0.000018
C  -0.167713 -0.364933 -0.000127
C  0.326851 0.975327 0.00005
C  -1.629077 -0.407299 -0.000122
C  0.751773 -1.44726 -0.000297
C  1.709975 1.25412 0.000064
C  -2.443219 -1.677833 -0.000304
C  2.132314 -1.177333 -0.000287
C  2.606745 0.164667 -0.000107
H  0.384484 -2.479342 -0.000446
H  2.084076 2.282472 0.000224
H  -3.51724 -1.436875 0.000286
H  -2.217908 -2.288907 -0.893934
H  -2.217069 -2.289727 0.892549
H  2.851331 -2.003191 -0.000419
H  3.685243 0.356539 -0.000086
