program: Gaussian 09
title: 000080335
version: EM64L-G09RevD.01
frameworkgroup: C1[X(C13H12N2O5S)]
method: RPBEPBE
basis: SDD
operation: Freq
keyword: #p
keyword: freq=noraman
keyword: PBEPBE/SDD
title: #p freq=noraman PBEPBE/SDD
converged: YES YES NO NO
title: Mulliken charges:
elementType: S O O O O O N N C C C C C C C C C C C C C H H H H H H H H H H H H
charge: 0.980540 -0.532775 -0.511749 -0.410214 -0.426018 -0.341279 -0.640576 -0.684227 -0.096976 0.549352 -0.234997 -0.173607 -0.551933 -0.397296 0.198360 0.101990 -0.317122 -0.386289 -0.398320 0.518270 0.168100 0.322090 0.281721 0.272585 0.255677 0.301666 0.270249 0.234471 0.234584 0.318254 0.318806 0.387764 0.388897
chargesum: 0.00000
title: Mulliken charges with hydrogens summed into heavy atoms:
elementType: S O O O O O N N C C C C C C C C C C C C C
charge: 0.980540 -0.532775 -0.511749 -0.022449 -0.037121 -0.341279 -0.318486 -0.047167 -0.096976 0.549352 0.046724 0.098979 -0.296256 -0.095630 0.198360 0.101990 -0.046873 -0.151818 -0.163736 0.518270 0.168100
polarizability: 2.79575737e+02 -1.84401649e+01 2.07475350e+02 1.90638586e+01 -5.86137857e+00 1.78332742e+02
1716.lowfreq: -4.7844 0.0006 0.0007 0.0010 4.5056 8.0856 12.3263 20.5906 38.4913
frequency: 11.8536 20.5134 38.4088 62.9111 87.8544 106.4187 115.8041 134.4162 163.4835 184.0182 194.5338 224.3648 234.3000 249.7175 278.6506 300.1727 314.6574 356.7710 390.2088 402.1661 412.1926 417.8016 420.6188 436.2307 442.3662 449.0600 452.8333 509.8849 520.2692 562.3457 566.0740 590.3514 598.9434 621.8406 624.2381 668.5006 697.8577 713.0143 722.9655 748.3448 752.0347 800.8067 813.9586 814.1519 833.6552 850.4465 853.4210 864.2178 948.4237 951.5747 961.9952 964.9337 978.8511 991.4578 1021.8040 1022.8306 1046.4972 1122.4350 1134.1850 1173.5520 1185.3435 1194.4829 1233.4454 1267.0596 1301.5198 1309.9978 1318.3461 1326.1744 1398.8162 1402.7431 1411.2379 1436.9946 1454.9284 1489.4340 1489.9982 1558.9728 1581.9330 1582.7350 1613.5407 1648.7303 1651.8940 2996.2122 3136.3645 3138.7260 3158.1125 3158.4480 3161.2852 3170.1140 3177.2495 3480.0341 3532.9985 3560.1768 3698.6070
redmass: 7.2699 5.4792 4.1664 6.9178 8.0065 6.3469 9.8582 7.1016 6.6632 11.1537 10.8322 6.4234 9.2995 6.4232 5.8458 6.6977 6.1450 7.3128 5.6817 3.4968 2.5694 1.0616 2.3604 4.7762 3.7986 2.8174 1.5721 3.0898 3.5199 5.1020 1.2227 5.2110 6.9861 6.8980 5.8441 3.3788 3.1946 2.9364 4.7484 6.0604 3.6823 7.3174 5.3703 1.3514 1.8388 1.4932 1.2826 1.3513 1.5144 3.5043 2.7848 1.7184 5.0914 1.3118 3.7056 1.6150 2.5397 1.7302 1.1951 1.5119 1.1447 1.5369 1.6958 1.4514 1.2982 4.4764 1.8665 2.5766 5.0246 3.3111 3.4691 3.9633 3.1038 2.9542 3.4484 4.0893 6.9695 5.9677 4.7919 1.6825 2.2915 1.0692 1.0889 1.0894 1.0920 1.0886 1.0962 1.0959 1.0977 1.0773 1.0641 1.0454 1.1040
irintensity: 2.9279 0.4698 0.2468 0.2453 5.3664 1.4545 1.1427 0.6692 4.0455 3.0773 3.3666 9.3039 7.0316 0.2856 11.4775 18.5489 3.5807 8.9020 30.7648 6.5492 1.3121 0.2793 13.7890 165.6705 49.2196 25.9782 383.8729 8.9020 20.0722 9.5760 109.2788 93.1425 21.9545 0.6525 55.4241 80.9163 40.2948 0.9991 21.6486 2.1996 5.5347 81.4621 112.5143 12.9818 77.3220 63.3589 153.9195 2.0961 3.2021 29.0141 67.2985 20.0396 8.9651 4.9990 224.0014 53.6435 59.2909 231.1726 13.9149 70.4414 64.6131 64.9752 34.8593 117.9358 5.7390 125.6324 91.0872 70.5215 6.4830 186.2522 41.1710 1.8960 271.3954 60.7202 123.0726 75.3820 6.5185 69.5070 184.0460 390.9243 451.6123 292.0727 10.4616 10.7404 2.5322 1.1147 6.5010 5.5510 0.4230 39.7980 81.5785 123.8634 27.0313
temp: 298.150 k
press: 1.00000 atm
elementType: 16 8 8 8 8 8 7 7 6 6 6 6 6 6 6 6 6 6 6 6 6 1 1 1 1 1 1 1 1 1 1 1 1
symmnumber: 1
zpe: 617122.6 jmol-1
zpe.correction: 0.235050 hartree
zpe.thermalcorrener: 0.254836 hartree
zpe.thermalcorrenthalpy: 0.255780 hartree
zpe.thermalcorrgfe: 0.184817 hartree
zpe.sumelectzpe: -1384.611755 hartree
zpe.sumelectthermal: -1384.591969 hartree
zpe.sumelectthermalent: -1384.591025 hartree
zpe.sumelectthermalfe: -1384.661988 hartree
dipole: 2.6347 8.3252 0.1164
dipole: 8.7330
quadrupole: -123.0732 -122.6638 -127.2481
quadrupole: 27.4324 19.6116 -9.3514
quadrupole: 1.2551 1.6646 -2.9197 27.4324 19.6116 -9.3514
hfenergy: -1384.8468048 hartree
pointgroup: C01 [X(C13H12N2O5S1)]
dipole: 0.7864817 -3.3216011 0.39146 debye
polarizability: 282.7710008|10.6378213|203.6481429|-18.5765016|-7.4151851|178.9646858 unknown
InChI: InChI=1S/C13H12N2O5S/c14-8-1-4-10(5-2-8)21(19,20)15-9-3-6-11(13(17)18)12(16)7-9/h1-7,15-17H,14H2
charge 0 multiplicity 1
33 atoms
S  2.106055 1.90028 0.078143
O  3.153705 2.63317 -0.923718
O  1.774974 2.431629 1.573061
O  -3.485117 -0.255479 -2.325666
O  -4.837416 -0.445417 1.70124
O  -5.23523 -0.921485 -0.530784
N  0.516935 2.037749 -0.916455
N  3.541739 -3.97208 0.409397
C  2.542482 0.090176 0.187523
C  -0.680749 1.392094 -0.57495
C  3.341557 -0.464027 -0.831571
C  2.076266 -0.659353 1.284864
C  -1.483878 0.835011 -1.602156
C  -1.119534 1.34848 0.790707
C  -2.733051 0.258028 -1.291103
C  -3.175666 0.196171 0.079069
C  -2.342447 0.748462 1.095169
C  3.677564 -1.824793 -0.752424
C  2.413297 -2.020479 1.356221
C  3.212577 -2.626755 0.337271
C  -4.462785 -0.420159 0.361563
H  0.779667 2.126588 -1.907007
H  3.713377 0.164588 -1.647327
H  1.484338 -0.181981 2.071614
H  -1.162264 0.843055 -2.64846
H  -0.510283 1.821812 1.565527
H  -2.696873 0.715028 2.129607
H  4.306216 -2.27453 -1.52925
H  2.063561 -2.620799 2.203532
H  4.11253 -4.410608 -0.308064
H  3.217492 -4.549422 1.180372
H  -4.344961 -0.642171 -1.929698
H  -5.72988 -0.878084 1.77485
