program: Gaussian 09
title: 000080266
version: EM64L-G09RevD.01
frameworkgroup: C1[X(C9H12O)]
method: RPBEPBE
basis: SDD
operation: Freq
keyword: #pfreq=noraman
keyword: PBEPBE/SDD
title: #p freq=noraman PBEPBE/SDD
converged: YES YES NO NO
title: Mulliken charges:
elementType: O C C C C C C C C C H H H H H H H H H H H H
charge: -0.448768 0.216159 -0.506395 0.359784 0.162047 -0.450555 -0.693220 -0.838496 -0.421526 -0.205421 0.208256 0.237982 0.229568 0.240992 0.214011 0.210751 0.231445 0.228963 0.233143 0.214657 0.223191 0.353430
chargesum: 0.00000
title: Mulliken charges with hydrogens summed into heavy atoms:
elementType: O C C C C C C C C C
charge: -0.095337 0.216159 -0.060156 0.359784 0.162047 -0.220987 -0.027465 -0.144944 -0.206870 0.017770
polarizability: 1.19117912e+02 -1.10253070e+00 1.16371077e+02 6.61825163e+00 -2.78056449e-01 5.80975158e+01
1716.lowfreq: -8.5524 -0.0007 0.0004 0.0005 4.6861 15.7430 58.9267 104.4701 136.3979
frequency: 58.6200 104.4579 136.3919 184.8806 212.3216 226.9034 302.1286 330.5986 346.8029 364.5699 465.9281 482.7878 530.8179 543.4421 567.9938 647.3477 735.1982 772.2857 777.1627 790.6460 859.9026 912.6837 952.0528 968.0945 1000.9621 1037.4575 1062.9238 1073.7346 1095.2498 1157.1005 1176.6041 1211.2038 1243.7303 1262.5058 1281.3389 1320.0940 1381.6755 1386.7097 1399.3934 1446.8557 1464.7504 1469.3696 1472.6370 1478.2929 1489.2067 1494.2591 1594.0551 1618.9022 2973.9133 2979.3142 3006.7944 3050.1326 3057.0344 3074.9744 3083.8650 3091.9006 3110.1995 3127.3206 3155.7451 3583.6459
redmass: 2.6018 3.6422 1.0364 3.1625 1.0847 3.3686 3.1884 2.1848 1.3275 2.4719 3.2717 4.0716 5.7958 3.5174 3.6554 4.0308 1.8555 1.9884 1.2934 3.9111 1.3516 2.5132 1.3132 2.4682 1.5733 1.5584 2.0389 1.6913 1.6586 1.4153 1.3166 2.1867 1.6347 2.4693 1.3869 1.4560 1.2008 3.7576 1.3937 2.1362 1.1705 1.0820 1.1420 1.2658 1.1259 1.6579 6.5374 6.7425 1.0379 1.0350 1.0603 1.0966 1.1006 1.0999 1.0986 1.1012 1.0881 1.0895 1.0990 1.0659
irintensity: 0.0866 0.4681 0.6295 6.2651 0.2340 0.5276 11.2532 3.7471 112.7396 15.0961 0.6368 5.2785 1.2152 1.6460 0.0697 1.0492 40.6064 40.8956 6.0282 4.8688 0.0156 49.5610 0.6578 8.6250 8.1966 9.9089 14.5055 59.9977 36.3418 47.9180 8.1482 8.8048 39.8764 35.6587 3.3010 0.5542 11.9043 11.9745 5.5876 18.5668 29.7905 14.5054 1.7668 13.3068 12.8290 15.7366 35.1924 11.6353 28.7106 43.0540 31.0944 19.8908 3.4341 59.1768 22.6981 33.1855 11.8169 18.9848 27.1110 26.0854
temp: 298.150 k
press: 1.00000 atm
elementType: 8 6 6 6 6 6 6 6 6 6 1 1 1 1 1 1 1 1 1 1 1 1
symmnumber: 1
zpe: 485611.3 jmol-1
zpe.correction: 0.184960 hartree
zpe.thermalcorrener: 0.195233 hartree
zpe.thermalcorrenthalpy: 0.196177 hartree
zpe.thermalcorrgfe: 0.149690 hartree
zpe.sumelectzpe: -424.628927 hartree
zpe.sumelectthermal: -424.618653 hartree
zpe.sumelectthermalent: -424.617709 hartree
zpe.sumelectthermalfe: -424.664197 hartree
dipole: 0.7709 -0.4471 0.1215
dipole: 0.8994
quadrupole: -57.8359 -50.3436 -64.2334
quadrupole: -4.1014 1.2349 -0.5377
quadrupole: -0.3649 7.1273 -6.7624 -4.1014 1.2349 -0.5377
hfenergy: -424.8138863 hartree
pointgroup: C01 [X(C9H12O1)]
dipole: -0.3151463 0.1527625 0.0504753 debye
dipolederiv: -0.3048986 -0.5062044 -0.0044548 -0.4222343 -1.1397936 0.0911117 -0.0299008 0.0895006 -0.3982017 0.2350455 0.108481 -0.0237322 -0.0914918 -0.351382 0.007229 -0.051497 -0.0260144 -0.1250112 -0.0016385 -0.0436122 -0.0232994 -0.0350391 0.1119591 0.0139163 -0.1180716 0.0145996 0.0881521 0.1426588 -0.1214893 -0.0455345 -0.0757495 0.3120171 0.0220646 -0.0333778 0.0436826 -0.0140777 0.200241 0.3855326 -0.0440444 0.3910947 1.0629837 -0.0760329 -0.0067239 -0.0653024 0.058524 -0.2038535 0.1311747 -0.0048478 0.1144779 -0.0989917 -0.0168797 -0.0010154 -0.0258059 -0.2124476 0.0134486 0.0029467 -0.0351295 0.0152299 0.0749037 -0.0168352 0.0516417 -0.0204286 -0.0001194 -0.0028997 0.140374 0.0072297 0.08315 -0.0602385 -0.0249672 0.0125325 -0.0513914 0.0582744 -0.1508692 -0.2737066 -0.0067599 0.0069931 -0.150522 0.0004118 -0.015806 0.050848 -0.2147714 0.0710163 0.0377768 -0.0497785 -0.0886138 0.1474406 0.0102109 -0.0373485 -0.0059743 -0.1270594 0.0023145 0.039943 0.0125407 0.0865513 -0.061293 -0.1360882 0.0240399 -0.0938119 -0.0124997 0.0354508 -0.0185585 0.0044953 -0.0670528 -0.0150096 0.116294 0.0194285 0.0751122 -0.0086101 0.0377855 -0.0664198 0.0194457 -0.1000329 -0.0973933 0.0157096 0.0226107 0.0133584 0.1585519 0.0940525 0.0706514 0.0356293 0.0184691 -0.0591942 -0.1157145 0.0173863 -0.0719593 0.016884 -0.2627299 -0.0218869 0.0107429 -0.0195391 0.099052 -0.0010408 0.0116177 0.0003779 0.0622698 0.0857287 -0.0564508 0.0279491 -0.0095821 -0.0725152 0.140277 0.0051441 0.0960467 -0.0223306 -0.0607186 0.0633457 -0.1063592 0.0280365 0.0583759 -0.0222412 -0.1204032 0.028971 0.0073888 -0.0076129 -0.1725942 0.0297287 -0.0631123 -0.0651894 0.021758 0.0298455 0.0493632 0.0985217 0.0511088 0.0542258 0.0915805 0.0346824 0.0394899 0.004342 0.0969152 -0.0584394 -0.093082 0.0384834 0.0619881 0.0226529 0.0945096 -0.1195416 -0.0158487 0.0253366 -0.014347 0.1690658 -0.1303972 -0.0008814 0.0517204 -0.0018514 0.0823687 0.0001427 0.0536439 0.0011043 0.1479854 0.1182838 0.1853642 0.030225 0.1011047 0.3024735 -0.0178191 0.0440017 -0.0294897 0.3625929 unknown
polarizability: 119.3048613|-0.7393881|116.2036522|-6.4306905|1.2291185|58.0779918 unknown
InChI: InChI=1S/C9H12O/c1-3-8-7(2)5-4-6-9(8)10/h4-6,10H,3H2,1-2H3
charge 0 multiplicity 1
22 atoms
O  0.410648 2.402157 -0.208835
C  0.459032 -0.007284 -0.240748
C  1.956871 0.087618 -0.487172
C  -0.220482 -1.254332 -0.115447
C  -0.2999 1.184473 -0.091014
C  -1.616515 -1.275299 0.142982
C  2.763464 0.220997 0.834349
C  0.530544 -2.56854 -0.265308
C  -1.690351 1.166111 0.163689
C  -2.348174 -0.076353 0.279795
H  2.307068 -0.801855 -1.041702
H  2.167515 0.971354 -1.11517
H  -2.129347 -2.239375 0.235958
H  2.470475 1.14055 1.370215
H  3.848589 0.273122 0.628441
H  2.580807 -0.638879 1.504729
H  1.390877 -2.633642 0.426302
H  -0.133609 -3.424975 -0.05911
H  0.930986 -2.694508 -1.289621
H  -2.249614 2.105082 0.271243
H  -3.425053 -0.106304 0.478368
H  -0.206832 3.169683 -0.120543
