program: Gaussian 09
title: 000080284
version: EM64L-G09RevD.01
frameworkgroup: C1[X(C8H18S2)]
method: RPBEPBE
basis: SDD
operation: Freq
keyword: #pfreq=noraman
keyword: PBEPBE/SDD
title: #p freq=noraman PBEPBE/SDD
converged: YES YES NO NO
title: Mulliken charges:
elementType: S S C C C C C C C C H H H H H H H H H H H H H H H H H H
charge: 0.019873 0.019847 0.000877 0.000884 -0.698441 -0.698451 -0.673958 -0.685308 -0.673971 -0.685313 0.230408 0.230405 0.266944 0.256285 0.266964 0.256285 0.196246 0.213367 0.236951 0.204288 0.219064 0.213416 0.196242 0.213382 0.236942 0.204286 0.219068 0.213417
chargesum: 0.00000
title: Mulliken charges with hydrogens summed into heavy atoms:
elementType: S S C C C C C C C C
charge: 0.019873 0.019847 0.231285 0.231289 -0.175212 -0.175202 -0.027394 -0.048539 -0.027406 -0.048543
polarizability: 1.63889322e+02 -5.04266790e-03 1.07191101e+02 -9.78864533e+00 2.05865916e-03 1.08828933e+02
1716.lowfreq: 0.0023 0.0030 0.0031 7.9921 10.4151 20.1970 33.5473 37.5155 43.0380
frequency: 33.4926 37.1282 43.0084 70.6667 79.8249 139.9972 194.7036 207.2853 207.7896 220.3162 223.0077 262.5161 263.0165 326.4325 330.3578 389.8443 393.5449 412.1192 414.2491 420.7982 661.9844 664.4392 802.0153 802.1349 854.8862 855.1204 919.2226 919.5029 947.6019 947.8781 957.0700 957.2506 1075.2084 1078.7487 1118.0357 1119.2024 1180.1715 1181.4241 1212.4406 1214.2420 1241.4328 1252.9198 1315.3967 1318.3757 1333.1279 1333.7904 1373.3739 1373.5448 1389.9990 1390.3400 1418.1398 1418.1579 1466.8818 1467.0060 1470.2340 1470.2558 1480.8078 1480.8577 1488.5327 1488.5804 2968.4747 2968.5241 2971.0799 2971.3672 2981.1591 2981.4182 2994.5375 2994.8386 3061.1659 3061.1781 3066.2553 3066.8049 3073.6481 3073.6723 3076.2176 3076.8918 3081.3934 3081.5191
redmass: 4.2384 3.6619 2.5441 3.1823 4.1571 2.5477 2.0951 1.0658 1.4287 1.5007 1.4750 1.6496 1.8389 2.8548 2.8306 2.2511 2.3750 3.0430 2.2690 6.0249 4.3646 4.3943 2.5282 2.4875 1.5264 1.5414 1.2117 1.2127 1.7805 1.7911 1.4345 1.4317 1.3142 1.3189 2.1704 2.2224 1.7959 1.7916 1.4742 1.4770 1.1943 1.1743 1.3779 1.3797 1.4714 1.4753 1.2082 1.2091 1.2006 1.2007 1.0982 1.0990 1.0518 1.0517 1.0466 1.0465 1.0520 1.0519 1.0498 1.0497 1.0354 1.0354 1.0374 1.0375 1.0787 1.0785 1.0624 1.0628 1.0992 1.0992 1.1002 1.0997 1.0994 1.0995 1.1025 1.1021 1.0995 1.0995
irintensity: 0.2836 0.1946 0.0090 0.2271 0.2861 0.0185 2.0439 0.0423 1.4742 0.6220 0.0831 0.4941 0.0726 0.1034 0.0004 0.9577 0.1399 0.0846 1.9855 0.0025 2.3113 4.7491 7.2566 0.8923 16.9583 2.9933 9.5113 4.2554 0.1151 24.1251 0.0705 0.1780 0.2869 6.9527 1.1775 2.4079 30.1954 0.1472 6.1336 1.1613 16.3451 0.9322 3.3216 0.1399 2.8877 0.9156 9.6039 44.0849 36.8181 0.0920 8.5287 6.1468 6.8521 0.3376 5.4567 7.9196 14.0631 0.0070 6.2766 35.8871 7.5655 58.4168 75.4587 0.0880 6.6623 2.4232 21.2545 16.5596 5.3754 16.1947 8.1653 73.7890 50.9877 34.9368 16.7806 50.2715 61.5516 6.1270
temp: 298.150 k
press: 1.00000 atm
elementType: 16 16 6 6 6 6 6 6 6 6 1 1 1 1 1 1 1 1 1 1 1 1 1 1 1 1 1 1
symmnumber: 1
zpe: 637971.9 jmol-1
zpe.correction: 0.242991 hartree
zpe.thermalcorrener: 0.257726 hartree
zpe.thermalcorrenthalpy: 0.258670 hartree
zpe.thermalcorrgfe: 0.199956 hartree
zpe.sumelectzpe: -1110.925530 hartree
zpe.sumelectthermal: -1110.910795 hartree
zpe.sumelectthermalent: -1110.909851 hartree
zpe.sumelectthermalfe: -1110.968565 hartree
dipole: -0.0001 2.2169 -0.0010
dipole: 2.2169
quadrupole: -73.1371 -81.3716 -80.0023
quadrupole: -0.0010 -1.1576 0.0005
quadrupole: 5.0332 -3.2013 -1.8320 -0.0010 -1.1576 0.0005
hfenergy: -1111.168521 hartree
pointgroup: C01 [X(C8H18S2)]
dipole: -0.000211 -0.8721958 -0.0021367 debye
polarizability: 163.5584227|-0.0359975|107.1911157|10.6736243|-0.0054722|109.1598167 unknown
InChI: InChI=1S/C8H18S2/c1-7(2)5-9-10-6-8(3)4/h7-8H,5-6H2,1-4H3
charge 0 multiplicity 1
28 atoms
S  -0.511071 0.821878 -1.010094
S  0.510963 0.816604 1.015491
C  -2.973132 -0.070623 0.24536
C  2.97311 -0.070222 -0.243664
C  -1.847166 -0.50131 -0.715672
C  1.846492 -0.505659 0.714494
C  -3.800482 1.10275 -0.323853
C  -3.874639 -1.292691 0.555861
C  3.800953 1.099297 0.332728
C  3.873903 -1.291087 -0.560866
H  -2.494135 0.255416 1.191353
H  2.494731 0.261636 -1.18794
H  -1.330547 -1.407321 -0.354595
H  -2.238716 -0.700661 -1.733164
H  1.329548 -1.409376 0.348168
H  2.237496 -0.710875 1.731025
H  -4.325751 0.798399 -1.25046
H  -4.56332 1.434402 0.40416
H  -3.152721 1.965425 -0.561737
H  -4.35648 -1.673659 -0.365347
H  -4.676519 -1.012758 1.263367
H  -3.29594 -2.120147 1.007588
H  4.325717 0.78914 1.257699
H  4.56425 1.434903 -0.392993
H  3.153564 1.960897 0.57549
H  4.355133 -1.677671 0.358314
H  4.676211 -1.00767 -1.266492
H  3.294748 -2.115517 -1.017521
