program: Gaussian 09
title: 000080267
version: EM64L-G09RevD.01
frameworkgroup: C1[X(C9H12O)]
method: RPBEPBE
basis: SDD
operation: Freq
keyword: #pfreq=noraman
keyword: PBEPBE/SDD
title: #p freq=noraman PBEPBE/SDD
converged: NO YES NO NO
title: Mulliken charges:
elementType: O C C C C C C C C C H H H H H H H H H H H H
charge: -0.440718 0.407467 -0.535236 0.300538 -0.541991 -0.382582 -0.682387 -0.835215 0.295971 -0.409122 0.215587 0.211641 0.255213 0.226306 0.216923 0.216834 0.227589 0.230358 0.227690 0.227007 0.217027 0.351101
chargesum: 0.00000
title: Mulliken charges with hydrogens summed into heavy atoms:
elementType: O C C C C C C C C C
charge: -0.089618 0.407467 -0.108008 0.300538 -0.286778 -0.156276 -0.021040 -0.150161 0.295971 -0.192095
polarizability: 1.30074408e+02 1.04206398e+00 1.07621344e+02 -5.37197152e+00 5.21287335e+00 5.86583713e+01
1716.lowfreq: -17.2442 -7.7152 0.0006 0.0006 0.0010 6.5911 68.7827 118.1755 141.0779
frequency: 68.6196 118.1648 141.0587 155.2063 208.6889 283.2430 310.4781 316.0038 345.1821 352.3476 438.1915 465.5525 473.1002 542.3410 615.8586 707.4311 727.1920 734.1183 793.4896 794.9296 887.1854 904.9494 920.6513 976.6546 996.8071 1037.8653 1050.8683 1065.1633 1118.7010 1151.2974 1179.3345 1202.4763 1247.2591 1265.9209 1287.0143 1312.8470 1383.5933 1385.0740 1401.5560 1439.7023 1468.2180 1470.8687 1473.9930 1486.5383 1495.0890 1496.1757 1589.2749 1632.8652 2968.7813 2978.1029 2991.2658 3039.9008 3043.2293 3075.3475 3077.8697 3082.8798 3108.3110 3134.1717 3145.3346 3582.0358
redmass: 2.6474 3.0402 1.7722 1.5137 1.0964 3.5462 2.7441 2.5492 3.4566 1.1215 4.3452 3.2914 2.9728 3.9328 3.5933 5.4648 3.1135 2.9843 1.3672 1.2814 1.5088 3.2639 1.3271 1.8791 1.8447 1.5528 1.6718 1.7853 1.6793 1.2788 1.6350 1.8952 1.3715 3.2909 1.3449 1.5254 1.3393 3.2677 1.2860 2.5136 1.0486 1.0777 1.1045 1.1178 1.3066 2.0066 6.9013 6.4252 1.0380 1.0348 1.0599 1.1011 1.0966 1.0999 1.0987 1.1008 1.0873 1.0962 1.0920 1.0660
irintensity: 0.0455 1.2240 2.9282 0.2295 0.3585 2.8512 5.9971 0.4405 3.3546 143.1109 5.8846 6.6060 3.8982 4.0255 5.3326 3.0929 2.9035 1.8638 39.5246 12.8606 20.2028 37.4603 0.1327 4.4811 7.2878 11.2824 31.1585 4.1028 56.4033 87.5931 45.4750 4.0052 8.9853 17.8855 20.4045 7.8120 11.1504 6.5360 14.5785 1.9480 13.3439 9.2940 11.3541 14.2348 30.3602 50.4697 34.9484 43.2649 40.1759 40.2088 34.7764 8.2103 23.6138 65.3538 23.0461 36.1090 16.8881 27.4966 3.7621 31.6387
temp: 298.150 k
press: 1.00000 atm
elementType: 8 6 6 6 6 6 6 6 6 6 1 1 1 1 1 1 1 1 1 1 1 1
symmnumber: 1
zpe: 485363.1 jmol-1
zpe.correction: 0.184865 hartree
zpe.thermalcorrener: 0.195120 hartree
zpe.thermalcorrenthalpy: 0.196064 hartree
zpe.thermalcorrgfe: 0.149670 hartree
zpe.sumelectzpe: -424.628463 hartree
zpe.sumelectthermal: -424.618208 hartree
zpe.sumelectthermalent: -424.617264 hartree
zpe.sumelectthermalfe: -424.663659 hartree
dipole: 0.1044 1.3736 0.2909
dipole: 1.4079
quadrupole: -50.2960 -59.2662 -63.8929
quadrupole: -4.6298 -2.6833 1.0983
quadrupole: 7.5224 -1.4479 -6.0746 -4.6298 -2.6833 1.0983
hfenergy: -424.8133284 hartree
pointgroup: C01 [X(C9H12O1)]
dipole: -0.0349565 0.5411239 -0.1130666 debye
dipolederiv: -1.1513603 0.5753882 -0.0157498 0.6630437 -0.4443058 -0.0769698 -0.0152717 -0.070317 -0.413319 0.2595219 0.0648713 -0.0039434 0.1940197 0.1898366 -0.0433713 -0.0427249 -0.0377411 -0.0832661 0.0216942 -0.0656966 -0.0230278 -0.0692059 0.1029882 -0.0214339 -0.1147229 -0.0732968 0.0941502 0.0343901 -0.2252347 0.0007799 -0.2302078 -0.1173841 0.031772 0.0041828 0.0587003 -0.0740667 -0.3886632 0.1401443 -0.0201177 -0.0715611 0.0019572 -0.0278805 0.032742 -0.0486842 -0.1805307 0.1180908 0.1317829 -0.050369 -0.0526295 0.0867357 -0.0285556 -0.0242485 -0.0575771 -0.1358342 0.0189589 -0.0310153 -0.0325423 -0.0247179 0.0588001 -0.0216714 0.0450249 0.0167571 -0.0017817 -0.0578814 0.0953066 0.0017082 0.0394793 0.0464254 -0.0113446 0.0250225 -0.0278568 0.0825357 1.1159981 -0.5245805 -0.0321895 -0.5998272 0.3989333 0.0156211 -0.0367592 0.0131406 0.0812827 -0.1812332 0.0095057 -0.02137 0.3426989 -0.1975677 -0.0509812 -0.0608964 -0.0063686 -0.210515 0.0331853 0.0440105 -0.0624536 -0.0191688 -0.0857116 0.1275049 -0.0145957 0.09164 -0.0238483 -0.0582808 0.0379028 0.0750274 0.0822711 -0.0009451 -0.1111858 0.0666137 -0.0675353 -0.0081537 0.1010053 -0.0141099 0.0185328 0.0026539 -0.0708544 0.0378315 0.0132152 0.0404968 0.1467508 0.077822 0.018148 0.0044908 -0.0068101 -0.1317696 0.0426437 0.0095043 0.0439088 0.1389073 0.088493 0.0252235 -0.0343985 0.0696793 -0.0616324 0.1350076 -0.0290839 0.0926477 -0.0145412 -0.170887 -0.1584086 0.0120787 -0.1560672 0.0086359 0.0016315 0.0112631 0.0032538 0.0621599 0.0109892 0.1182852 0.081781 0.0693964 -0.0021557 -0.092686 0.0395374 -0.0645765 0.0113235 -0.0127159 0.0539798 0.0825893 0.0352354 0.0763235 0.0319681 0.1254782 -0.0261891 -0.0966485 0.0720483 -0.1035194 0.024617 0.011966 -0.1433599 0.049962 0.0026442 0.0707633 0.0905657 -0.0924106 -0.0034589 -0.0893677 -0.0422318 0.0683939 -0.0738601 -0.1289434 -0.0334478 0.0017976 -0.1288515 -0.0645026 0.0494369 -0.0524325 0.0573932 0.026514 0.0493699 0.029329 0.1662813 0.2900868 -0.1240224 0.0344871 -0.185584 0.1592635 0.0594837 0.0426486 0.0529532 0.3667504 unknown
polarizability: 130.0581088|-1.2729763|107.6735687|-5.369097|-5.0274429|58.6224462 unknown
InChI: InChI=1S/C9H12O/c1-3-8-6-9(10)5-4-7(8)2/h4-6,10H,3H2,1-2H3
charge 0 multiplicity 1
22 atoms
O  2.941348 -1.240223 -0.026307
C  -0.64388 -0.322441 0.300287
C  -1.951568 -1.064819 0.550771
C  -0.617284 1.088201 0.063434
C  0.562585 -1.059522 0.263015
C  0.629953 1.703111 -0.205685
C  -2.623143 -1.538517 -0.767335
C  -1.882136 1.931442 0.113746
C  1.792774 -0.424376 -0.009882
C  1.835173 0.968288 -0.247071
H  -1.758506 -1.947878 1.188853
H  -2.661021 -0.421128 1.104456
H  0.56048 -2.139189 0.448677
H  0.661949 2.784544 -0.385868
H  -2.846865 -0.684336 -1.43222
H  -3.570737 -2.068952 -0.558896
H  -1.956631 -2.225034 -1.319918
H  -2.328955 1.939875 1.127163
H  -1.666412 2.978107 -0.162419
H  -2.660877 1.556131 -0.576463
H  2.787105 1.473722 -0.457342
H  3.747947 -0.701704 -0.221495
