program: Gaussian 09
title: 000080257
version: EM64L-G09RevD.01
frameworkgroup: C1[X(C6H6N2O4)]
method: RPBEPBE
basis: SDD
operation: Freq
keyword: #pfreq=noraman
keyword: PBEPBE/SDD
title: #p freq=noraman PBEPBE/SDD
converged: NO YES NO NO
title: Mulliken charges:
elementType: O O O O N N C C C C C C H H H H H H
charge: -0.308800 -0.232538 -0.227097 -0.205748 -0.404818 -0.390838 0.249771 -0.326482 0.139426 0.185429 0.221011 -0.491257 0.381307 0.292620 0.368269 0.253369 0.243060 0.253316
chargesum: 0.00000
title: Mulliken charges with hydrogens summed into heavy atoms:
elementType: O O O O N N C C C C C C
charge: -0.308800 -0.232538 -0.227097 -0.205748 -0.023510 -0.022570 0.249771 -0.033862 0.139426 0.185429 0.221011 0.258489
polarizability: 1.27447223e+02 1.04996237e+01 1.11375351e+02 -2.13805572e-02 -1.04356870e-02 4.24859694e+01
1716.lowfreq: -1.8298 -0.0008 -0.0007 -0.0006 3.2448 8.3489 55.7252 81.2771 109.0743
frequency: 55.7252 81.2604 109.0740 126.7314 161.4174 183.3596 198.1306 271.7017 309.2667 375.0356 399.5440 500.6611 509.2837 551.5640 581.2954 668.5904 687.6620 722.7121 737.6354 744.2965 779.6388 849.2112 873.9415 937.4425 974.3973 996.4461 1075.9669 1117.0699 1152.0665 1198.9662 1210.9507 1295.7071 1345.6679 1369.8437 1425.9262 1453.9739 1462.1930 1464.9875 1604.0016 1649.4095 1655.5338 1680.6545 3014.4455 3120.7516 3163.0608 3217.4079 3528.3081 3544.1626
redmass: 5.6284 1.1779 3.9629 5.0056 7.7305 5.4426 4.8360 5.6812 7.1023 8.4547 10.9859 7.5796 7.6686 9.9283 5.1001 2.4854 2.0212 6.6040 3.0906 1.9242 1.9719 7.5957 1.5422 5.8746 3.0330 7.0929 2.6644 1.2625 1.4714 9.2625 2.6610 1.8890 2.4412 1.7951 1.1773 1.0483 1.1368 2.9182 7.9607 9.6896 7.7627 5.9868 1.0294 1.1053 1.1054 1.0944 1.0771 1.0780
irintensity: 1.0934 0.1748 0.2634 0.0423 8.9088 1.0379 3.6709 15.4430 6.7664 10.0802 20.6135 7.2903 13.3876 4.4116 4.6439 1.8305 26.5942 9.6335 37.9172 11.4454 185.6918 6.0226 43.5683 1.7458 17.5917 84.1161 41.3181 0.0108 48.6786 46.4864 307.1053 122.5918 59.1548 23.6826 26.0560 17.7027 2.4834 118.6305 97.0182 256.0780 223.1564 619.6029 23.3025 18.5552 10.1683 8.3613 67.6837 126.7149
temp: 298.150 k
press: 1.00000 atm
elementType: 8 8 8 8 7 7 6 6 6 6 6 6 1 1 1 1 1 1
symmnumber: 1
zpe: 329793.0 jmol-1
zpe.correction: 0.125612 hartree
zpe.thermalcorrener: 0.136569 hartree
zpe.thermalcorrenthalpy: 0.137513 hartree
zpe.thermalcorrgfe: 0.088065 hartree
zpe.sumelectzpe: -641.793297 hartree
zpe.sumelectthermal: -641.782339 hartree
zpe.sumelectthermalent: -641.781395 hartree
zpe.sumelectthermalfe: -641.830843 hartree
dipole: 5.1289 1.7415 -0.0025
dipole: 5.4165
quadrupole: -62.4844 -85.6466 -67.7637
quadrupole: 3.9513 0.0201 0.0075
quadrupole: 9.4805 -13.6817 4.2012 3.9513 0.0201 0.0075
hfenergy: -641.9189081 hartree
pointgroup: C01 [X(C6H6N2O4)]
dipole: 2.0026469 0.7284939 -0.0019876 debye
dipolederiv: -1.2292744 -0.3688102 -0.0010374 -0.5909265 -0.9020857 -0.0003124 -0.0029507 -0.0019469 -0.3031347 -0.5966106 0.2957649 0.0001501 0.3363419 -1.2785618 0.0000211 0.0001924 -0.0001649 -0.3848708 -0.9166409 -0.4764616 0.0008408 -0.2489414 -0.8471421 0.000506 0.001401 0.0012139 -0.3609338 -0.7716261 0.2113707 0.0010849 0.0796616 -0.761268 -0.0020758 -0.0006253 0.001544 -0.297287 -0.8254677 0.6852134 0.000286 -0.1141315 -0.9800106 0.0004601 0.0011486 -0.0007675 -0.2863175 -0.4116155 -0.1488712 0.0000812 -0.0662336 -1.290831 0.0007406 0.0001222 0.0005994 -0.3545006 -0.3099788 -0.1763263 0.000184 0.1115331 0.9375027 -0.0006364 0.0013281 -0.0003252 0.086955 -0.6592125 -0.324372 0.0005759 0.106113 -0.247873 0.000023 0.0011825 0.0006801 -0.1604589 1.2412578 -0.4555065 -0.0012282 -0.3068411 1.8429318 -0.0003841 -0.0012255 0.0003883 0.3377945 1.3767257 0.4202349 -0.0015433 0.0583149 1.387012 -0.0007319 -0.0026069 -0.0013874 0.2688399 1.7055068 0.2126145 -0.0008593 0.4636052 1.3340247 0.002485 0.0004211 0.0001441 0.2590395 0.7283267 0.168042 0.0008566 0.0983665 0.2408946 -0.0000302 0.0010089 0.0003983 0.2753731 0.3366556 0.0458699 0.0001766 0.0313064 0.2540709 -0.0001655 0.0000863 -0.0002623 0.3388234 0.0966931 0.020392 0.0001459 0.0432635 0.0948852 -0.0000143 0.0002704 0.0000821 0.1824058 0.2378312 -0.0080109 0.0002157 -0.0144154 0.1476919 0.0000879 0.000223 0.0000565 0.3463048 -0.0223541 -0.0341126 -0.0120015 0.0521128 0.0694003 0.0944472 -0.0539569 0.0637647 -0.0383382 0.0424948 -0.0332812 -0.000179 -0.0916416 -0.0706446 -0.0004761 -0.0003795 -0.0004575 0.1289426 -0.0227111 -0.0337499 0.0122512 0.0525123 0.0700028 -0.0939442 0.0543605 -0.0635597 -0.0386371 unknown
polarizability: 126.9872873|10.8361277|111.8352424|-0.059722|-0.0310791|42.4860134 unknown
InChI: InChI=1S/C6H6N2O4/c1-12-5(10)3-2-4(9)8-6(11)7-3/h2,7-8H,1H3
charge 0 multiplicity 1
18 atoms
O  2.498147 0.717979 -0.001627
O  -1.853048 2.609442 -0.000188
O  -2.885943 -1.966613 0.003727
O  2.379847 -1.618135 -0.001943
N  -0.103686 1.050023 -0.002605
N  -2.333201 0.306649 0.001622
C  0.340265 -0.270319 -0.002786
C  -0.540849 -1.327313 -0.000743
C  -1.465468 1.413929 -0.000312
C  -1.986463 -1.080754 0.001439
C  1.819722 -0.502284 -0.005359
C  3.981675 0.637529 0.001767
H  0.585138 1.806905 -0.004348
H  -0.177277 -2.355093 -0.000847
H  -3.334357 0.526797 0.003336
H  4.324474 0.101918 0.901955
H  4.320259 1.681936 0.004362
H  4.328664 0.105004 -0.898649
