program: Gaussian 09
title: 000080237
version: EM64L-G09RevD.01
frameworkgroup: C1[X(C7H8O3)]
method: RPBEPBE
basis: SDD
operation: Freq
keyword: #p
keyword: freq=noraman
keyword: PBEPBE/SDD
title: #p freq=noraman PBEPBE/SDD
converged: NO YES NO YES
title: Mulliken charges:
elementType: O O O C C C C C C C H H H H H H H H
charge: -0.232223 -0.280817 -0.259520 0.052127 0.286263 -0.308801 -0.747884 -0.176130 0.163046 -0.500585 0.279435 0.254599 0.254653 0.237939 0.263570 0.241206 0.241228 0.231893
chargesum: 0.00000
title: Mulliken charges with hydrogens summed into heavy atoms:
elementType: O O O C C C C C C C
charge: -0.232223 -0.280817 -0.259520 0.052127 0.286263 -0.029366 -0.000693 0.087440 0.163046 0.213742
polarizability: 1.11370395e+02 -3.47557600e-01 9.30273966e+01 5.60112874e-03 1.51770484e-04 4.52164574e+01
1716.lowfreq: -106.4767 -13.1740 -4.7827 -4.5634 -0.0006 -0.0005 -0.0005 57.2827 75.3688
frequency: -106.4374 57.1716 75.2962 121.2205 128.7626 217.6864 255.8033 257.3642 315.8031 409.8995 473.8268 591.5725 619.2006 666.8034 728.4103 744.1728 747.9851 872.0687 881.3662 887.5554 933.1437 989.0438 1036.6892 1050.0619 1112.6521 1117.2176 1144.4823 1163.7741 1234.9348 1269.2981 1384.3783 1406.0630 1429.0906 1445.9545 1450.6085 1463.0534 1464.0915 1505.4037 1591.9742 1627.2895 2997.7510 3003.2627 3075.6611 3103.1992 3115.8443 3147.9815 3241.2732 3276.3834
redmass: 1.0155 1.6241 1.9799 3.9191 3.7547 4.6110 3.8056 3.9075 3.8388 6.5380 4.7598 3.9171 5.5569 5.1240 1.7328 5.6580 2.9082 5.9744 1.3387 5.8485 2.1626 3.1937 1.4558 3.8227 1.2644 1.5932 1.4404 2.2535 5.2488 2.3849 2.6203 1.2841 1.3672 1.0437 1.0501 1.0924 1.0522 5.8077 8.7054 10.3876 1.0368 1.0297 1.0968 1.1043 1.1002 1.1044 1.0917 1.1093
irintensity: 0.1531 0.7437 2.3461 2.3148 0.8540 10.5423 10.6181 1.0898 8.3309 0.1155 10.6148 6.5068 0.2856 2.7461 79.7172 6.6922 4.5687 7.1009 8.9450 31.6250 26.3500 7.3497 5.2564 167.2508 0.0418 117.2706 14.1165 46.8986 27.5838 126.6270 31.8032 10.5374 36.5941 16.7499 14.6607 7.0541 12.3586 15.6779 120.8400 209.2262 7.6870 38.4347 6.6750 28.9129 10.9451 17.2583 1.4935 0.2070
temp: 298.150 k
press: 1.00000 atm
elementType: 8 8 8 6 6 6 6 6 6 6 1 1 1 1 1 1 1 1
symmnumber: 1
zpe: 357878.0 jmol-1
zpe.correction: 0.136309 hartree
zpe.thermalcorrener: 0.145780 hartree
zpe.thermalcorrenthalpy: 0.146725 hartree
zpe.thermalcorrgfe: 0.100824 hartree
zpe.sumelectzpe: -496.450954 hartree
zpe.sumelectthermal: -496.441482 hartree
zpe.sumelectthermalent: -496.440538 hartree
zpe.sumelectthermalfe: -496.486438 hartree
dipole: -0.3299 -1.2905 0.0004
dipole: 1.3319
quadrupole: -49.8795 -55.7056 -59.1102
quadrupole: 2.7110 -0.0036 -0.0003
quadrupole: 5.0189 -0.8072 -4.2118 2.7110 -0.0036 -0.0003
hfenergy: -496.5872624 hartree
pointgroup: C01 [X(C7H8O3)]
dipole: 0.1125843 -0.5117923 -0.0001913 debye
dipolederiv: -0.7639455 -0.0399578 -0.0003383 -0.1030964 -0.4432026 0.000016 -0.0003559 -0.0000061 -0.1386593 -1.3619245 0.3199207 0.0001946 0.6052333 -0.7135018 0.0000605 0.0010565 -0.0005059 -0.3036241 -0.750889 -0.1874835 -0.0003265 -0.11255 -0.9212751 -0.0007748 0.000008 0.0005658 -0.3220765 -0.8950446 0.0449822 -0.0002775 0.0571041 -0.167036 0.0000833 -0.0008473 -0.0000222 -0.0595412 0.7464469 0.0354616 0.0004187 -0.2748618 0.4735281 -0.0001364 0.0001675 0.0001463 0.0423126 0.0145852 0.0465168 0.000097 0.1227646 0.0250676 0.0000676 0.0000111 0.0000329 -0.1735631 0.0797942 -0.0475289 0.0000518 0.0703138 -0.2277931 0.0000523 0.0001109 -0.0001269 0.0347041 0.0500796 -0.1638389 0.0002277 -0.0122046 0.1667835 -0.0000363 0.0001475 -0.0001006 -0.1576813 2.0111781 -0.0965944 0.0004486 -0.350406 1.3050152 0.0007746 0.0002631 0.0000665 0.2571266 0.7269207 -0.0793133 -0.0002003 0.0083008 0.222683 -0.000072 -0.0003093 0.000059 0.2818218 0.1216245 0.0683624 -0.0000613 0.0447655 0.04057 0.0000188 -0.0000451 0.0000365 0.1911385 0.0703843 -0.015254 -0.081759 0.004644 0.0314981 -0.0389211 -0.0573414 -0.0723395 -0.0060086 0.0700976 -0.0154574 0.0819382 0.0045027 0.0316146 0.0388967 0.0575402 0.0722514 -0.0055789 -0.0999444 0.0864439 -0.0002589 0.010791 0.083117 0.0000006 -0.0002602 0.0000898 0.1312337 0.0410243 -0.0528462 -0.0001214 -0.0317712 0.0494487 -0.0000356 -0.0001251 -0.0000693 0.227793 -0.0288074 0.0136129 -0.0068056 -0.0880543 0.0532692 -0.1029603 -0.0585572 -0.077687 -0.0602234 -0.0286817 0.0137486 0.0066839 -0.0879189 0.0530808 0.1031315 0.0583748 0.0777635 -0.0600937 -0.0028982 0.0692253 0.0000881 0.1324432 -0.0628671 -0.0001654 0.000162 -0.000154 0.1209198 unknown
polarizability: 111.3729516|-0.2716322|93.0248335|0.0206642|0.0048098|45.2164639 unknown
InChI: InChI=1S/C7H8O3/c1-5-6(3-4-10-5)7(8)9-2/h3-4H,1-2H3
charge 0 multiplicity 1
18 atoms
O  -2.493623 -0.159967 -0.000702
O  2.07346 -0.787521 0.001082
O  1.536089 1.487643 0.001173
C  -0.219589 -0.195305 0.001102
C  -1.34062 0.639499 0.000168
C  -0.694433 -1.569639 0.00054
C  -1.534587 2.118814 0.000096
C  -2.069674 -1.514096 -0.000427
C  1.165645 0.283799 0.002314
C  3.502725 -0.400511 0.000211
H  -0.066085 -2.456332 0.000977
H  -1.057216 2.577918 0.883747
H  -1.05508 2.578099 -0.882297
H  -2.609407 2.361198 -0.001158
H  -2.866488 -2.251362 -0.001033
H  3.740031 0.194585 0.898243
H  3.738729 0.19551 -0.897551
H  4.051224 -1.352731 -0.000686
