program: Gaussian 09
title: 000080353
version: EM64L-G09RevD.01
frameworkgroup: C1[X(C14H26O2)]
method: RPBEPBE
basis: SDD
operation: Freq
keyword: #pfreq=noraman
keyword: PBEPBE/SDD
title: #p freq=noraman PBEPBE/SDD
converged: YES YES NO NO
title: Mulliken charges:
elementType: O O C C C C C C C C C C C C C C H H H H H H H H H H H H H H H H H H H H H H H H H H
charge: -0.276425 -0.255320 -0.003995 -0.431069 -0.451262 -0.393343 -0.393616 -0.383835 -0.401532 -0.403148 -0.377320 -0.391354 -0.383652 -0.378875 0.288366 -0.762479 0.247069 0.191385 0.238646 0.199593 0.222553 0.217618 0.207191 0.217019 0.204211 0.189697 0.201663 0.199257 0.190550 0.197998 0.192260 0.182419 0.195616 0.191432 0.196409 0.195371 0.211072 0.182063 0.191420 0.245793 0.246535 0.244018
chargesum: 0.00000
title: Mulliken charges with hydrogens summed into heavy atoms:
elementType: O O C C C C C C C C C C C C C C
charge: -0.276425 -0.255320 0.243074 -0.001038 -0.029116 0.031466 0.027614 0.007526 -0.011724 -0.012890 0.000715 -0.003514 0.022791 -0.005392 0.288366 -0.026133
polarizability: 1.84877933e+02 -1.32415644e+00 1.55035287e+02 2.63917423e+00 3.45958552e+00 1.25926771e+02
1716.lowfreq: -10.7591 -3.9598 0.0009 0.0009 0.0011 8.7265 40.0186 44.5721 51.7304
frequency: 39.9517 44.5172 51.6672 69.2360 74.0085 100.1714 140.3129 158.9118 179.1495 207.1450 209.5722 221.6827 231.6799 248.3612 274.4622 297.1546 310.3769 322.6562 352.0694 399.3143 425.2255 454.4678 486.9407 506.7722 555.4101 580.3449 625.2331 699.7212 717.6983 735.7403 760.1655 778.0125 794.4490 811.5267 820.6935 851.1822 893.4625 911.0390 916.5156 932.7725 952.9834 975.8798 996.4711 1000.9348 1022.3084 1040.1286 1041.7872 1044.9181 1063.5379 1085.8626 1096.7121 1110.3568 1123.5475 1133.7587 1139.5410 1162.0872 1174.8029 1192.9921 1207.4510 1227.8246 1243.7571 1251.9017 1261.6815 1274.3656 1286.0286 1290.7673 1297.8781 1301.6928 1311.3806 1320.3214 1331.2801 1340.6653 1343.9452 1350.0107 1350.8932 1354.6062 1358.4007 1362.2083 1367.8764 1382.5704 1453.6887 1455.7765 1458.7048 1461.3752 1466.0001 1467.1849 1467.8003 1471.7503 1475.2136 1481.5358 1484.8119 1488.5403 1493.6168 1639.7444 2951.4049 2953.9787 2957.6869 2967.0590 2970.3896 2971.5300 2979.4916 2981.7430 2990.8266 2994.5275 3000.8938 3002.5099 3004.5998 3005.9250 3008.6819 3013.0234 3019.7930 3021.6206 3030.1731 3037.4972 3044.8439 3056.3009 3060.7019 3071.3293 3097.4516 3139.1026
redmass: 4.0482 1.3112 3.0177 3.0234 3.0515 3.0037 2.6616 3.3094 2.2584 2.9912 2.8358 2.4946 2.8554 2.3683 2.1594 2.0865 2.7733 2.3845 2.2635 2.2700 2.3182 2.6761 2.1649 2.5790 3.3442 3.1404 3.9632 1.3380 1.2366 1.5693 2.1235 1.4785 2.4344 1.7763 1.7857 2.4590 2.3995 2.5700 2.1708 2.1875 1.9419 1.9169 1.8785 2.0186 1.6512 2.2303 1.7417 2.0519 2.0773 2.0296 1.7658 2.0033 1.5955 1.8138 2.1570 1.5295 1.4059 1.4918 3.0011 1.2623 1.2688 1.3213 1.2072 1.2866 1.2049 1.1441 1.2146 1.1474 1.3072 1.2030 1.4583 1.3794 1.3978 1.3566 1.4094 1.3889 1.4586 1.4491 1.4123 1.2497 1.0612 1.0521 1.0775 1.0815 1.0814 1.0733 1.0857 1.0866 1.0827 1.0843 1.0853 1.0782 1.0934 9.3792 1.0610 1.0602 1.0599 1.0626 1.0618 1.0658 1.0646 1.0676 1.0644 1.0619 1.0736 1.0980 1.0381 1.0943 1.0930 1.0821 1.0969 1.0958 1.0988 1.0981 1.0953 1.0977 1.0981 1.0978 1.0946 1.1021
irintensity: 1.0176 0.9472 1.0641 1.2994 0.2158 0.9869 0.1843 1.9240 0.0311 2.5516 1.8044 4.3573 2.5085 0.6165 0.2505 0.1725 0.8234 1.1429 2.5584 0.4842 0.7254 2.6449 2.1398 3.7703 4.6016 7.2871 2.7144 2.6301 20.1446 9.4289 1.4303 1.0340 5.5599 8.6100 0.8535 2.7160 12.1411 31.8329 14.6541 10.5565 9.5485 19.2929 78.0302 23.7616 1.3830 4.2814 5.1648 5.2498 7.2307 2.8983 1.5050 10.2103 1.0084 2.4433 2.5248 14.7151 17.9458 49.0730 342.4557 8.9418 4.4904 1.2877 0.3211 1.2286 2.1250 1.8668 1.1437 1.1732 1.3637 0.7781 1.2724 0.2680 0.4055 1.3787 1.9578 2.0875 0.0138 0.1520 1.6647 54.7214 22.6008 18.5163 4.3668 2.9611 11.8876 8.6232 6.9968 1.4658 6.8835 6.3596 2.0795 1.8404 50.1801 189.9037 37.6007 22.1869 31.0122 19.8563 67.8683 37.0785 23.6001 7.7058 34.2267 0.2624 9.2228 4.6320 3.1678 69.8643 3.6441 22.3782 91.5280 20.5710 135.6461 22.1681 32.4991 87.7541 128.3849 26.1105 10.4954 11.0222
temp: 298.150 k
press: 1.00000 atm
elementType: 8 8 6 6 6 6 6 6 6 6 6 6 6 6 6 6 1 1 1 1 1 1 1 1 1 1 1 1 1 1 1 1 1 1 1 1 1 1 1 1 1 1
symmnumber: 1
zpe: 989698.8 jmol-1
zpe.correction: 0.376956 hartree
zpe.thermalcorrener: 0.394813 hartree
zpe.thermalcorrenthalpy: 0.395757 hartree
zpe.thermalcorrgfe: 0.330988 hartree
zpe.sumelectzpe: -698.228937 hartree
zpe.sumelectthermal: -698.211081 hartree
zpe.sumelectthermalent: -698.210137 hartree
zpe.sumelectthermalfe: -698.274906 hartree
dipole: -1.4318 1.4621 0.9557
dipole: 2.2586
quadrupole: -101.3715 -103.0870 -99.5836
quadrupole: 7.4102 6.2082 -2.5562
quadrupole: -0.0242 -1.7396 1.7638 7.4102 6.2082 -2.5562
hfenergy: -698.6058938 hartree
pointgroup: C01 [X(C14H26O2)]
dipole: -0.5898089 0.5420898 0.3845405 debye
polarizability: 184.7665438|-0.6725365|154.6330396|3.9852923|4.7337943|126.4404066 unknown
InChI: InChI=1S/C14H26O2/c1-13(15)16-14-11-9-7-5-3-2-4-6-8-10-12-14/h14H,2-12H2,1H3
charge 0 multiplicity 1
42 atoms
O  2.73361 0.478763 0.282639
O  4.006505 -1.28329 -0.574636
C  1.552726 0.052568 -0.560022
C  0.785279 -1.03942 0.218388
C  0.772975 1.344321 -0.87479
C  -0.504681 -1.515146 -0.495112
C  0.150627 2.08313 0.342693
C  -1.489241 -2.245635 0.449478
C  -1.186053 2.80848 0.023492
C  -2.916611 -2.416967 -0.134718
C  -2.383161 1.874428 -0.30829
C  -3.662794 -1.126494 -0.583284
C  -2.793994 0.934444 0.851104
C  -3.943973 -0.054849 0.509948
C  3.892117 -0.295152 0.188664
C  4.952451 0.219274 1.140302
H  1.963742 -0.379568 -1.49366
H  0.524876 -0.644231 1.219378
H  1.467586 -1.894447 0.38224
H  -0.019462 1.074737 -1.599092
H  1.454768 2.026793 -1.417231
H  -0.248224 -2.170486 -1.351907
H  -1.02366 -0.639645 -0.921334
H  0.880301 2.819996 0.727381
H  -0.016592 1.374348 1.173825
H  -1.551829 -1.689287 1.405892
H  -1.086519 -3.246118 0.7082
H  -1.027552 3.503076 -0.827474
H  -1.460702 3.440543 0.893288
H  -3.541328 -2.937926 0.62035
H  -2.862839 -3.09645 -1.011267
H  -2.143746 1.276115 -1.210118
H  -3.255391 2.500289 -0.589208
H  -4.63957 -1.454233 -0.994078
H  -3.132727 -0.660055 -1.437025
H  -3.116786 1.560594 1.709324
H  -1.91111 0.371348 1.201474
H  -4.819595 0.54662 0.186912
H  -4.25719 -0.574134 1.439884
H  4.75504 -0.171147 2.155588
H  4.931055 1.319231 1.194738
H  5.943573 -0.13242 0.817165
