program: Gaussian 09
title: 000080223
version: EM64L-G09RevD.01
frameworkgroup: C1[X(C6H11NO2)]
method: RPBEPBE
basis: SDD
operation: Freq
keyword: #p
keyword: freq=noraman
keyword: PBEPBE/SDD
title: #p freq=noraman PBEPBE/SDD
converged: YES YES NO NO
title: Mulliken charges:
elementType: O O N C C C C C C H H H H H H H H H H H
charge: -0.254810 -0.250005 -0.001577 0.066317 -0.235164 -0.222212 -0.667215 -0.674865 -0.141698 0.192945 0.221810 0.190929 0.235583 0.187647 0.210183 0.225768 0.239443 0.207636 0.230579 0.238706
chargesum: 0.00000
title: Mulliken charges with hydrogens summed into heavy atoms:
elementType: O O N C C C C C C
charge: -0.254810 -0.250005 -0.001577 0.259262 0.177575 0.201018 0.008180 0.002056 -0.141698
polarizability: 8.94037510e+01 4.46015966e+00 8.61614269e+01 -1.97590751e-01 -2.20478648e+00 5.88296191e+01
1716.lowfreq: -7.9164 -5.5213 -0.0010 -0.0008 0.0006 11.8785 46.0293 55.3490 63.6566
frequency: 45.9370 55.3428 63.6545 90.7319 116.3241 183.9200 215.9465 238.4355 241.5628 294.9887 328.8512 394.3283 460.5705 567.4416 591.8977 811.5017 816.7506 833.3415 860.0018 923.3102 947.5126 1021.2786 1033.8134 1075.9773 1118.4434 1118.9431 1134.4487 1138.6041 1246.5615 1256.9425 1295.2909 1307.2789 1367.0196 1377.8944 1397.4614 1399.4719 1459.7708 1459.9188 1477.9336 1479.3151 1489.9693 1491.1839 2200.3754 2855.9594 2937.2510 2949.2758 2997.7119 2998.0327 2999.0291 3047.9702 3095.3408 3095.8673 3106.1893 3107.8901
redmass: 2.0809 3.5462 1.6767 3.3770 5.4501 3.0052 2.4566 1.3465 1.5041 4.2561 4.0489 3.8294 7.3331 5.4741 6.0351 1.1064 1.1330 3.0169 3.2007 4.7606 5.9777 2.6130 3.1363 4.5132 2.1812 2.2207 1.4672 1.4727 1.1620 1.1389 1.1224 1.2413 1.3326 1.2875 1.2607 1.2877 1.0400 1.0400 1.0527 1.0517 1.0771 1.0785 12.6190 1.0799 1.0582 1.0646 1.0375 1.0389 1.0994 1.0979 1.0988 1.0992 1.1012 1.1015
irintensity: 0.1686 3.8862 2.2915 1.5979 2.6875 1.2963 4.9923 1.7464 4.5697 4.0302 2.9936 2.1232 1.7070 0.2278 1.9218 9.3543 5.9831 10.5913 16.0067 83.5657 186.0524 23.4223 144.4391 129.0983 11.2311 32.4535 15.6496 6.3016 3.6462 1.8142 31.0709 41.2028 2.6203 0.3162 15.2379 28.9880 12.7672 10.9353 4.0370 9.4844 7.8556 6.8094 1.4240 59.7630 54.1580 59.3833 30.3662 11.1645 35.1956 18.3514 28.0103 31.0769 31.7352 35.6090
temp: 298.150 k
press: 1.00000 atm
elementType: 8 8 7 6 6 6 6 6 6 1 1 1 1 1 1 1 1 1 1 1
symmnumber: 1
zpe: 428387.3 jmol-1
zpe.correction: 0.163164 hartree
zpe.thermalcorrener: 0.174448 hartree
zpe.thermalcorrenthalpy: 0.175392 hartree
zpe.thermalcorrgfe: 0.124922 hartree
zpe.sumelectzpe: -439.652952 hartree
zpe.sumelectthermal: -439.641668 hartree
zpe.sumelectthermalent: -439.640724 hartree
zpe.sumelectthermalfe: -439.691194 hartree
dipole: 0.0359 -4.2608 2.8037
dipole: 5.1006
quadrupole: -47.0860 -65.4623 -53.7522
quadrupole: -1.3658 0.3421 1.3219
quadrupole: 8.3475 -10.0288 1.6813 -1.3658 0.3421 1.3219
hfenergy: -439.8161161 hartree
pointgroup: C01 [X(C6H11N1O2)]
dipole: 0.0946906 1.67739 1.0974529 debye
dipolederiv: -1.1342462 0.3077549 0.0033728 0.4247339 -0.7157314 -0.0675344 -0.0892975 0.0314299 -0.4047025 -1.2030965 -0.2319841 -0.027591 -0.3456596 -0.6580287 0.0026517 0.0276591 0.0030413 -0.3865919 -0.1782828 -0.0408969 0.004605 0.0279423 -0.2045081 0.0233892 0.020509 -0.0008494 -0.1978901 1.4979811 0.0261437 0.0330199 -0.3410205 1.0548272 0.0168703 0.0778288 -0.179549 0.7342559 0.772515 -0.2468976 -0.0621191 -0.0885171 0.3661251 0.0904008 -0.1725711 0.1762967 0.3729759 0.6424032 0.2027921 0.0598403 0.4388524 0.5111349 -0.0034578 0.184301 0.0405407 0.3915429 -0.0376662 0.0901551 -0.0283806 0.0850574 -0.0450142 0.0412895 -0.0120783 0.030992 0.0298034 -0.1345067 -0.0346529 0.0470299 -0.0478715 0.0364637 -0.0028015 0.0347546 -0.0064113 0.0342299 -0.1732126 0.0311426 0.0038239 -0.0224767 -0.1989984 -0.0044709 -0.0476044 -0.0258977 -0.0776961 -0.0509682 -0.0416936 0.0150327 0.0503986 -0.0381255 -0.0632919 0.0110861 0.0405454 -0.2002467 -0.0910575 -0.0400606 0.0141386 -0.1206115 -0.1122231 0.0085547 0.0232643 -0.0399065 0.0530599 -0.0394627 0.0401937 -0.0823163 0.0190055 0.0388406 -0.016859 0.0282637 -0.0497671 -0.2204036 -0.0086412 0.0776835 -0.0322691 -0.0105936 -0.117448 0.0262302 -0.0519811 0.0498947 0.0416537 0.0000013 -0.0298382 0.0612056 -0.0807944 0.0077186 0.0112757 -0.010187 -0.056859 -0.2181295 -0.1216453 0.0739056 0.0851542 0.0576929 0.0728243 0.0022911 0.0995837 -0.0101641 0.0581431 0.0309726 -0.1410829 -0.0184704 -0.0844274 -0.0737969 -0.0056913 -0.0410021 -0.0067053 0.0887625 0.1147527 -0.0111611 -0.0184579 0.0004361 0.0746103 -0.0528548 -0.0557406 -0.0113824 -0.1186804 -0.0136598 -0.1032072 -0.0193549 -0.125917 -0.0645547 -0.0591212 -0.0301466 -0.0636041 0.0901793 0.0371389 0.0685776 -0.0206776 0.1312491 -0.0464341 0.0718055 -0.0276652 0.0854219 0.0595176 0.0906808 0.0031263 -0.0175861 0.0325211 0.1123184 -0.018676 0.0310235 -0.0070668 -0.1297832 unknown
polarizability: 89.9658823|4.2156474|85.6137885|0.313612|2.0967434|58.8151263 unknown
InChI: InChI=1S/C6H11NO2/c1-3-8-6(5-7)9-4-2/h6H,3-4H2,1-2H3
charge 0 multiplicity 1
20 atoms
O  -0.752465 0.616212 -0.302951
O  1.386023 -0.3779 -0.171074
N  -0.976141 -2.853134 -0.243977
C  0.048105 -0.442229 0.323715
C  -2.061493 0.834188 0.359185
C  2.111683 0.847311 0.268721
C  -2.716029 2.030979 -0.326876
C  3.539145 0.718123 -0.2531
C  -0.489326 -1.79192 -0.004596
H  0.01031 -0.304879 1.435466
H  -2.686432 -0.076517 0.251776
H  -1.90053 1.025177 1.443235
H  1.596682 1.732569 -0.146122
H  2.084306 0.899533 1.379219
H  -3.704816 2.233204 0.123049
H  -2.091003 2.934301 -0.221563
H  -2.855602 1.828539 -1.402167
H  4.130988 1.605804 0.035287
H  4.028468 -0.180817 0.158682
H  3.539824 0.640355 -1.353509
