program: Gaussian 09
title: 000080400
version: EM64L-G09RevD.01
frameworkgroup: C1[X(C26H11N3O4S)]
method: RPBEPBE
basis: SDD
operation: Freq
keyword: #p
keyword: freq=noraman
keyword: PBEPBE/SDD
title: #p freq=noraman PBEPBE/SDD
converged: NO YES NO NO
title: Mulliken charges:
elementType: S O O O O N N N C C C C C C C C C C C C C C C C C C C C C C C C C C H H H H H H H H H H H
charge: 0.968200 -0.437967 -0.437970 -0.182502 -0.157451 -0.417816 0.094614 0.033112 0.017658 0.238586 0.325316 -0.070879 -0.209505 0.173603 0.574846 -0.169572 -0.301941 -0.172701 -0.207838 -0.313978 -0.455471 0.351713 0.280055 -0.211363 0.046037 0.069403 -0.374056 -0.389104 -0.235812 -0.233504 -0.328336 -0.341014 -0.213514 -0.216378 0.274590 0.297966 0.247407 0.292807 0.291086 0.241415 0.240518 0.279371 0.262812 0.239177 0.238380
chargesum: 0.00000
title: Mulliken charges with hydrogens summed into heavy atoms:
elementType: S O O O O N N N C C C C C C C C C C C C C C C C C C C C C C C C C C
charge: 0.968200 -0.437967 -0.437970 -0.182502 -0.157451 -0.417816 0.094614 0.033112 0.017658 0.238586 0.325316 -0.070879 -0.209505 0.173603 0.574846 -0.169572 -0.301941 -0.172701 -0.207838 -0.039388 -0.157505 0.351713 0.280055 0.036044 0.046037 0.069403 -0.081249 -0.098019 0.005603 0.007014 -0.048964 -0.078202 0.025663 0.022002
polarizability: 5.83462636e+02 1.63687556e+01 5.42908778e+02 1.85249536e-02 -3.30889204e-03 1.38063846e+02
1716.lowfreq: -0.0001 0.0012 0.0015 2.1803 4.2843 7.9483 32.4957 32.9449 41.8706
frequency: 32.4840 32.9305 41.8293 58.4531 66.0327 72.7493 98.4162 104.3722 112.6129 128.5852 159.9346 172.7124 176.4499 202.3224 213.5122 230.3557 236.9839 245.2706 269.4131 276.3004 291.3249 316.3052 344.8738 353.2907 354.0980 369.4079 391.5535 426.7259 445.3980 449.4659 453.8115 454.0325 459.9848 488.3547 491.2184 521.3100 522.9714 542.0681 553.5300 579.0352 585.7278 598.6461 600.5575 627.7063 647.9138 692.6935 698.9919 710.1166 714.6706 718.8602 728.1566 733.6193 746.0873 777.5641 777.5959 787.8297 798.9392 806.9758 852.8929 857.7326 874.8584 887.6689 888.4927 907.9202 928.4303 935.2106 940.2804 952.0096 977.0675 989.1778 997.0288 997.5661 1003.5123 1005.8106 1006.9512 1014.4951 1035.0770 1039.0438 1061.4399 1084.2580 1105.6075 1118.7069 1153.0798 1164.8763 1172.5590 1181.9440 1192.1569 1226.1939 1236.3073 1241.7251 1270.4550 1275.6903 1283.2261 1299.6039 1316.9512 1349.1916 1369.7099 1392.6214 1397.4950 1404.9328 1417.8461 1432.3396 1440.6432 1444.6555 1456.9042 1466.0998 1467.9283 1498.9249 1508.1750 1537.3733 1541.0896 1550.7043 1559.0176 1589.2172 1603.6947 1609.1476 1617.3513 1642.3772 3137.1920 3138.2534 3150.4797 3151.5237 3153.5211 3159.8518 3166.0612 3171.0370 3173.9076 3176.0467 3182.7160
redmass: 6.9833 7.6702 11.5851 5.6332 8.0703 6.7163 7.8035 8.9857 10.3858 5.2186 8.2408 5.7008 7.1900 12.7107 6.7621 7.2382 7.6978 7.6710 7.9236 6.6354 6.9790 7.0284 6.5986 10.5973 12.0374 7.0939 14.9743 3.4964 5.3125 11.0316 5.0955 8.6015 10.7713 3.8658 10.1886 9.2304 4.2028 4.6117 7.5746 5.0928 7.8032 9.5796 6.1417 10.0994 6.9633 8.3020 4.9076 3.9479 8.2895 7.5942 4.3093 7.6471 3.1380 1.2844 6.8601 1.9580 2.4971 1.7903 16.4644 3.1508 7.3762 8.5575 1.6489 2.3676 8.6015 1.7977 8.8496 2.1790 1.3540 19.9421 1.3938 7.1050 1.3322 1.4799 2.1217 1.3642 2.2045 2.3680 5.4361 2.5187 3.1721 1.6834 1.7015 1.2429 1.0934 1.4554 2.8613 2.5155 3.2299 2.4789 3.8129 1.8941 3.9721 7.1266 2.3904 5.4399 4.4432 10.0000 6.3025 6.1631 3.7568 3.1723 3.2401 4.6078 3.9956 3.1861 3.2851 6.9847 9.8249 6.8487 9.4543 10.0667 9.5445 8.0886 8.4547 6.8119 6.8517 10.9986 1.0861 1.0862 1.0900 1.0897 1.0877 1.0946 1.0962 1.1006 1.0928 1.1003 1.0983
irintensity: 1.6028 2.9839 0.1596 1.1716 0.6016 0.0826 3.8404 0.0516 0.0301 0.2242 1.9665 0.0014 3.7317 1.3046 0.0270 8.3679 0.7739 0.0119 0.4806 5.7669 2.1597 24.6995 0.0995 38.4450 46.4500 3.4542 37.5444 1.8544 5.4172 10.0889 3.3897 18.5066 6.0400 0.6539 3.9478 8.4930 1.2885 0.8081 0.1366 0.0108 13.6303 2.6148 0.9369 1.7208 5.2483 0.1643 16.9081 39.4196 1.3240 0.3822 8.8043 6.9701 11.7278 47.0082 9.3048 83.6495 41.9340 16.1511 115.7974 0.2999 5.0024 20.0344 0.0099 0.0448 40.5742 0.0331 114.5855 1.2968 2.5443 70.0769 4.5977 39.6021 0.0447 1.5515 9.8984 0.0278 2.1987 5.2510 32.2400 10.1477 0.3834 4.9139 4.2573 4.4427 19.3497 4.4865 17.2327 59.3799 214.9400 75.1759 2.4812 1.0302 165.6258 49.8695 19.8351 29.1748 46.3752 11.6428 18.4488 37.3571 9.3266 86.8239 85.9711 45.4156 47.7771 9.0306 26.6628 60.5101 4.1351 19.9424 78.3879 218.1120 3.1004 16.7367 28.8538 5.7756 4.8225 21.1530 3.6109 2.2827 4.3566 7.0907 2.8775 1.5098 12.9858 41.6071 1.6348 32.6129 5.3011
temp: 298.150 k
press: 1.00000 atm
elementType: 16 8 8 8 8 7 7 7 6 6 6 6 6 6 6 6 6 6 6 6 6 6 6 6 6 6 6 6 6 6 6 6 6 6 1 1 1 1 1 1 1 1 1 1 1
symmnumber: 1
zpe: 795679.2 jmol-1
zpe.correction: 0.303058 hartree
zpe.thermalcorrener: 0.328042 hartree
zpe.thermalcorrenthalpy: 0.328986 hartree
zpe.thermalcorrgfe: 0.248173 hartree
zpe.sumelectzpe: -1858.192783 hartree
zpe.sumelectthermal: -1858.167800 hartree
zpe.sumelectthermalent: -1858.166855 hartree
zpe.sumelectthermalfe: -1858.247669 hartree
dipole: -5.5802 -1.3242 -0.0010
dipole: 5.7352
quadrupole: -169.5691 -177.7639 -209.4964
quadrupole: -27.0699 0.0004 -0.0018
quadrupole: 16.0407 7.8459 -23.8866 -27.0699 0.0004 -0.0018
hfenergy: -1858.4958415 hartree
pointgroup: C01 [X(C26H11N3O4S1)]
dipole: -2.1617402 0.6466936 0.0003784 debye
polarizability: 581.4436442|-18.5940244|544.9277701|-0.0186849|-0.0022354|138.0638458 unknown
InChI: InChI=1S/C26H11N3O4S/c30-25-12-6-1-2-7-13(12)26(31)24-20(25)19-22-21(27-15-9-3-4-10-16(15)28-22)14-8-5-11-17-18(14)23(19)29(24)34(17,32)33/h1-11H
charge 0 multiplicity 1
45 atoms
S  1.418449 -3.714473 -0.000353
O  2.00518 -4.255893 -1.395332
O  2.005432 -4.255672 1.394596
O  4.321936 -1.444525 -0.000561
O  1.056926 3.060216 -0.000603
N  1.383702 -1.637256 -0.00048
N  -1.831568 1.874047 -0.00027
N  -3.908474 -0.121392 0.000008
C  0.062789 -1.284498 -0.000387
C  -0.933339 -2.28937 -0.000213
C  -0.126712 0.110047 -0.000448
C  2.134273 -0.468198 -0.000595
C  -0.521112 -3.628026 -0.000168
C  1.22841 0.647127 -0.000715
C  -2.29905 -1.920967 -0.000073
C  -1.522733 0.554328 -0.000282
C  -2.60099 -0.475415 -0.000159
C  3.597138 -0.397951 -0.000586
C  1.782961 2.019686 -0.001131
C  -1.420058 -4.692525 0.000011
C  -3.242055 -2.985681 0.000104
C  4.152041 0.990777 -0.000489
C  3.291671 2.131404 -0.000646
C  -2.806799 -4.330127 0.000147
C  -3.165115 2.225672 -0.000106
C  -4.217936 1.222827 0.000029
C  5.556612 1.163466 -0.000184
C  3.862863 3.42611 -0.000481
C  6.113935 2.458558 -0.000014
C  5.264078 3.592048 -0.000174
C  -3.516648 3.613359 -0.000069
C  -5.587582 1.635659 0.000162
C  -4.861443 3.988248 0.00008
C  -5.900439 2.996296 0.000193
H  -1.11282 -5.74159 0.000052
H  -4.308249 -2.743157 0.000196
H  -3.549744 -5.134072 0.000282
H  6.18721 0.268537 -0.000064
H  3.187237 4.28734 -0.000639
H  7.201345 2.587724 0.000243
H  5.694451 4.599101 -0.000069
H  -2.702811 4.344434 -0.000169
H  -6.361546 0.862032 0.000244
H  -5.13346 5.049212 0.000108
H  -6.947851 3.316733 0.000306
