program: Gaussian 09
title: 000080277
version: EM64L-G09RevD.01
frameworkgroup: C1[X(C13H11Cl2F4N3O)]
method: RPBEPBE
basis: SDD
operation: Freq
keyword: #p
keyword: freq=noraman
keyword: PBEPBE/SDD
title: #p freq=noraman PBEPBE/SDD
converged: YES YES NO NO
title: Mulliken charges:
elementType: Cl Cl F F F F O N N N C C C C C C C C C C C C C H H H H H H H H H H H
charge: -0.057610 -0.030033 -0.184468 -0.172404 -0.168180 -0.164343 -0.246564 -0.106305 -0.046485 -0.107054 -0.277000 -0.413654 -0.277689 0.717564 -0.341515 -0.363979 0.385228 -0.205210 -0.240324 -0.162394 -0.111401 0.058785 -0.280306 0.263904 0.245008 0.242731 0.241352 0.245290 0.232537 0.285275 0.262320 0.278171 0.233208 0.265545
chargesum: 0.00000
title: Mulliken charges with hydrogens summed into heavy atoms:
elementType: Cl Cl F F F F O N N N C C C C C C C C C C C C C
charge: -0.057610 -0.030033 -0.184468 -0.172404 -0.168180 -0.164343 -0.246564 -0.106305 -0.046485 -0.107054 -0.013097 0.074085 0.208953 0.717564 -0.341515 -0.131442 0.385228 0.080065 0.021996 0.115777 -0.111401 0.291993 -0.014761
polarizability: 1.74222747e+02 -2.30235949e+01 1.85766826e+02 8.63263650e+00 -8.66576028e+00 1.65178805e+02
1716.lowfreq: -6.9267 -3.6698 -0.7536 0.0008 0.0018 0.0020 6.5825 14.4498 15.6641
frequency: 6.1038 13.9543 15.5820 20.2901 23.7049 40.8341 49.2202 69.5361 96.4544 107.4380 139.8033 148.0821 164.3525 173.0163 195.5031 209.4645 219.4756 247.8784 302.8853 325.0508 346.5393 354.5050 364.8305 388.3514 391.7822 433.1400 461.4500 490.0821 504.1496 530.1868 534.7218 575.5091 619.2681 631.5645 665.7091 669.9980 697.9793 725.1263 739.4172 765.7158 784.7477 802.7661 822.1021 847.5372 869.4802 908.1428 917.4103 919.9496 936.8151 953.6347 959.7992 1002.8708 1003.7074 1017.8734 1024.0371 1051.6077 1078.7614 1086.8634 1110.4796 1115.5983 1126.0292 1154.9443 1184.0536 1208.0054 1212.3674 1223.7787 1242.1092 1263.0228 1278.9685 1292.5827 1299.4223 1317.7567 1339.6642 1343.2806 1360.6985 1378.3808 1385.6480 1389.3597 1394.0529 1431.0240 1463.3693 1471.6817 1481.3434 1571.0223 1597.9920 3003.9650 3009.3083 3031.7641 3079.4310 3089.6013 3093.2989 3136.1400 3180.1100 3185.8108 3241.6959 3258.2036
redmass: 13.3031 9.4713 8.3233 9.0358 6.4108 9.3522 12.3686 8.7552 7.6705 8.3181 9.2836 6.3305 6.0633 4.3464 5.3728 10.4526 12.4457 11.7550 6.5048 5.4177 6.0657 4.0646 6.3225 8.5375 7.4005 3.3900 11.2816 5.4396 8.2692 6.2811 6.0684 3.6920 4.0694 4.1818 3.2581 5.7381 6.8618 3.8014 4.3997 6.9360 5.8953 1.5495 1.4194 1.3965 1.4260 2.7550 2.9960 7.5757 9.7043 1.4004 3.8720 6.1937 4.1456 6.2140 2.6184 3.7914 3.0859 2.4308 6.6552 2.5481 2.0127 1.4974 1.5780 2.0902 1.2310 2.6735 2.8558 1.6971 1.8030 1.1427 1.2033 2.8321 1.9662 1.7375 2.1152 3.6674 1.5121 2.1103 2.0386 3.0941 2.3920 1.1533 1.1220 7.4822 7.3950 1.0593 1.0620 1.0845 1.1073 1.0987 1.0881 1.0896 1.0953 1.0938 1.0987 1.1005
irintensity: 1.9258 0.2064 0.5877 1.6451 1.4545 0.9582 1.0913 0.5999 1.1930 0.7582 0.9418 0.7702 0.1233 3.1197 3.5407 2.1836 2.0773 1.4623 2.3002 4.6781 9.0720 0.7661 3.9900 2.4512 4.4851 0.3533 10.9843 17.7717 4.2434 1.8138 1.2136 37.9794 17.1133 11.1882 31.2376 5.1087 45.9840 9.7270 6.8616 34.3911 50.6213 21.7451 27.2045 17.3048 19.1892 25.1343 7.0506 29.6749 116.6400 1.4300 33.1153 97.4478 94.4062 23.6908 8.5762 54.6869 0.3558 55.3413 574.8139 35.1634 16.8733 2.0289 8.3586 20.0306 15.1413 84.7187 20.4538 5.5834 7.2851 0.8194 1.7127 1.4932 4.7398 17.3616 16.9380 10.3121 9.5118 2.4745 0.5329 29.6444 78.9628 4.4085 31.7431 24.3232 48.9530 8.0551 45.9931 3.3495 9.6115 13.6920 13.8831 8.0231 0.5684 1.4244 1.1564 1.2748
temp: 298.150 k
press: 1.00000 atm
elementType: 17 17 9 9 9 9 8 7 7 7 6 6 6 6 6 6 6 6 6 6 6 6 6 1 1 1 1 1 1 1 1 1 1 1
symmnumber: 1
zpe: 600481.9 jmol-1
zpe.correction: 0.228711 hartree
zpe.thermalcorrener: 0.250907 hartree
zpe.thermalcorrenthalpy: 0.251851 hartree
zpe.thermalcorrgfe: 0.169426 hartree
zpe.sumelectzpe: -2059.213050 hartree
zpe.sumelectthermal: -2059.190854 hartree
zpe.sumelectthermalent: -2059.189910 hartree
zpe.sumelectthermalfe: -2059.272335 hartree
dipole: 0.0238 -2.1845 -0.7583
dipole: 2.3125
quadrupole: -179.4246 -146.9346 -140.7866
quadrupole: -7.2552 12.1882 3.1896
quadrupole: -23.7094 8.7807 14.9287 -7.2552 12.1882 3.1896
hfenergy: -2059.441761 hartree
pointgroup: C01 [X(C13H11Cl2F4N3O1)]
dipole: -0.103666 -0.8323354 -0.3524568 debye
polarizability: 167.4546061|-20.5176782|193.2069844|6.1619752|-8.8308309|164.5067874 unknown
InChI: InChI=1S/C13H11Cl2F4N3O/c14-9-1-2-10(11(15)3-9)8(4-22-7-20-6-21-22)5-23-13(18,19)12(16)17/h1-3,6-8,12H,4-5H2
charge 0 multiplicity 1
34 atoms
Cl -0.375932 0.310985 2.716141
Cl -1.568252 4.933497 -0.067911
F  3.760223 -2.368264 0.138271
F  3.807751 -0.779522 -1.490962
F  4.126595 1.263851 0.493217
F  5.685077 -0.415978 0.608284
O  2.11935 -0.702181 0.126144
N  -2.670966 -1.771498 -0.421856
N  -3.658167 -1.273508 -1.287097
N  -4.53385 -1.690784 0.823703
C  -0.260414 -1.108107 -0.134579
C  -1.303972 -1.958793 -0.915586
C  1.119761 -1.363534 -0.766064
C  -0.604382 0.378417 -0.100094
C  -0.668616 1.122657 1.101274
C  -0.858298 1.090477 -1.301536
C  3.445694 -0.974084 -0.117049
C  -0.959144 2.500559 1.137827
C  -1.150591 2.468494 -1.312646
C  -3.21664 -2.007962 0.823496
C  -1.194428 3.155576 -0.084508
C  4.317561 -0.105363 0.817707
C  -4.754336 -1.250037 -0.478208
H  -0.214619 -1.483254 0.903788
H  -1.331018 -1.687471 -1.98385
H  -1.028056 -3.028159 -0.844759
H  1.349844 -2.444301 -0.814506
H  1.20828 -0.916082 -1.77197
H  -0.838989 0.556468 -2.25827
H  -0.999278 3.041016 2.086146
H  -1.345133 2.993391 -2.251298
H  -2.658742 -2.389245 1.67461
H  4.066888 -0.264005 1.879807
H  -5.720599 -0.908556 -0.838765
