program: Gaussian 09
title: 000080177
version: EM64L-G09RevD.01
frameworkgroup: C1[X(C3HCl2NO2)]
method: RPBEPBE
basis: SDD
operation: Freq
keyword: #p
keyword: freq=noraman
keyword: PBEPBE/SDD
title: #p freq=noraman PBEPBE/SDD
converged: NO NO NO NO
title: Mulliken charges:
elementType: Cl Cl O O N C C C H
charge: 0.067029 0.067097 -0.113049 -0.092423 -0.061778 -0.642337 0.264430 0.156481 0.354549
chargesum: 0.00000
title: Mulliken charges with hydrogens summed into heavy atoms:
elementType: Cl Cl O O N C C C
charge: 0.067029 0.067097 -0.113049 -0.092423 -0.061778 -0.287788 0.264430 0.156481
polarizability: 9.56439481e+01 -3.04059390e-02 5.58728482e+01 6.60367796e+00 -9.33229968e-03 4.21502389e+01
1716.lowfreq: -27.1335 -9.5869 -8.4224 -1.2268 -0.0014 0.0006 0.0009 94.4493 104.7462
frequency: -26.9459 94.4480 104.7431 189.9380 205.0586 237.9616 337.0228 507.9968 551.3603 608.4556 637.8496 701.1592 744.6510 805.0631 1029.5867 1200.7320 1236.5076 1422.5935 1640.1826 2255.4785 3156.6450
redmass: 17.7542 13.7349 15.8865 18.5264 21.3539 13.6308 19.2323 12.2184 12.7360 13.2720 11.7078 7.2563 9.8774 10.8228 3.2788 1.0640 1.4813 12.5738 11.3754 12.7055 1.0897
irintensity: 0.0270 0.2488 0.5393 1.4507 0.4689 1.1162 0.9942 0.4173 8.0069 119.9501 58.8760 68.1757 38.0528 64.7804 198.5953 9.1944 13.2916 165.7910 181.2470 1158.2988 2.4047
temp: 298.150 k
press: 1.00000 atm
elementType: 17 17 8 8 7 6 6 6 1
symmnumber: 1
zpe: 105674.7 jmol-1
zpe.correction: 0.040249 hartree
zpe.thermalcorrener: 0.047623 hartree
zpe.thermalcorrenthalpy: 0.048568 hartree
zpe.thermalcorrgfe: 0.006597 hartree
zpe.sumelectzpe: -1239.630168 hartree
zpe.sumelectthermal: -1239.622794 hartree
zpe.sumelectthermalent: -1239.621850 hartree
zpe.sumelectthermalfe: -1239.663821 hartree
dipole: -0.5443 0.0038 -2.3208
dipole: 2.3838
quadrupole: -64.7452 -57.5907 -60.9068
quadrupole: -0.0003 -0.3128 0.0164
quadrupole: -3.6643 3.4902 0.1741 -0.0003 -0.3128 0.0164
hfenergy: -1239.6704173 hartree
pointgroup: C01 [X(C3H1Cl2N1O2)]
dipole: -0.215861 -0.0009521 0.9126889 debye
dipolederiv: -0.2728933 0.2558227 -0.0214833 0.1450862 -0.5462997 -0.0142704 0.00189 -0.071616 -0.0919398 -0.2734808 -0.2565687 -0.0216198 -0.1459203 -0.5454214 0.0136817 0.0022045 0.0711145 -0.0916058 -0.6528967 0.0001693 -0.0643649 -0.0009095 -0.2541659 0.0013939 0.3496468 0.0014298 -0.8376163 -1.5599246 -0.0004724 0.1266451 -0.0005815 -0.2062833 -0.0000422 0.0733375 -0.0000659 -0.1642776 -2.5494425 -0.001283 0.4637635 -0.0006913 -0.2463574 0.000695 0.0807602 0.0004972 -0.5435969 0.3689012 0.0014131 -0.0697452 0.0018359 1.2619116 0.0010981 -0.1846065 0.000923 0.1734413 2.1965389 0.0003261 -0.3157377 0.0008492 0.1462919 -0.0027119 -0.5045703 -0.0025351 1.2557676 2.7454226 0.0006771 -0.1591973 0.0004591 0.4250322 0.0002158 0.1590349 0.0003062 0.2869195 -0.0022249 -0.0000841 0.0617397 -0.0001279 -0.034708 -0.00006 0.0223028 -0.0000537 0.012908 unknown
polarizability: 95.6683467|0.0339577|55.872842|-6.5040262|-0.0195087|42.1258465 unknown
InChI: InChI=1S/C3HCl2NO2/c4-2(5)3(8)6-1-7/h2H
charge 0 multiplicity 1
9 atoms
Cl 2.436807 -1.537305 0.200096
Cl 2.44032 1.534469 0.201713
O  0.212748 0.004234 -1.617371
O  -3.408458 -0.001258 0.360137
N  -0.9720 -0.000633 0.417012
C  1.442904 -0.000379 0.527217
C  0.202579 0.001191 -0.373984
C  -2.204136 -0.000772 0.311737
H  1.186635 -0.000747 1.591744
