program: Gaussian 09
title: 000080170
version: EM64L-G09RevD.01
frameworkgroup: C1[X(C4H5NO3)]
method: RPBEPBE
basis: SDD
operation: Freq
keyword: #pfreq=noraman
keyword: PBEPBE/SDD
title: #p freq=noraman PBEPBE/SDD
converged: YES YES NO NO
title: Mulliken charges:
elementType: O O O N C C C C H H H H H
charge: -0.342914 -0.180859 -0.180888 -0.129130 -0.499411 -0.499404 0.189005 0.188991 0.269930 0.267969 0.267964 0.269937 0.378810
chargesum: 0.00000
title: Mulliken charges with hydrogens summed into heavy atoms:
elementType: O O O N C C C C
charge: 0.035896 -0.180859 -0.180888 -0.129130 0.038487 0.038497 0.189005 0.188991
polarizability: 7.50888735e+01 -7.54807439e-04 6.39236656e+01 -2.01838351e-03 1.66291989e+00 3.61167386e+01
1716.lowfreq: -107.5182 -16.2121 -11.5012 -10.8295 0.0001 0.0007 0.0009 82.2800 110.5145
frequency: -107.5116 82.2669 110.5143 224.1623 278.9502 337.6095 539.4523 546.5180 552.3270 564.2031 633.1566 671.5887 819.9518 994.2090 1007.2221 1013.2143 1037.7180 1144.7779 1159.8242 1208.4171 1212.5150 1279.4100 1295.2799 1375.7354 1438.2258 1456.0522 1659.9691 1715.0646 3028.5926 3037.5701 3081.8258 3099.1284 3473.9198
redmass: 1.0492 1.8094 9.4143 4.9495 15.4916 12.4274 3.4451 4.3875 2.6130 11.4241 6.1791 7.0846 1.4665 3.2193 2.6657 3.8927 4.9391 1.1995 11.2947 1.1102 2.8285 1.5430 1.4788 1.5866 1.0728 1.0946 12.5346 12.4572 1.0594 1.0631 1.1036 1.1018 1.0684
irintensity: 109.3305 1.2737 11.9701 11.2600 1.5076 12.7762 0.0068 0.7629 4.7455 0.7850 50.6350 13.3663 18.3229 74.8924 0.0242 1.3534 41.9924 1.2093 249.0979 0.0785 6.9274 0.2436 1.4938 84.5462 0.7258 22.4764 649.0888 17.8026 12.8998 1.4874 0.0261 7.5116 23.8215
temp: 298.150 k
press: 1.00000 atm
elementType: 8 8 8 7 6 6 6 6 1 1 1 1 1
symmnumber: 1
zpe: 239727.9 jmol-1
zpe.correction: 0.091308 hartree
zpe.thermalcorrener: 0.098329 hartree
zpe.thermalcorrenthalpy: 0.099273 hartree
zpe.thermalcorrgfe: 0.059495 hartree
zpe.sumelectzpe: -435.205091 hartree
zpe.sumelectthermal: -435.198069 hartree
zpe.sumelectthermalent: -435.197125 hartree
zpe.sumelectthermalfe: -435.236903 hartree
dipole: -0.0010 -2.9830 1.6534
dipole: 3.4106
quadrupole: -63.1522 -38.4188 -42.4846
quadrupole: -0.0052 -0.0016 4.8361
quadrupole: -15.1336 9.5998 5.5339 -0.0052 -0.0016 4.8361
hfenergy: -435.2963981 hartree
pointgroup: C01[X(C4H5N1O3)]
dipole: 0.0005712 -1.1928127 -0.6145561 debye
dipolederiv: -0.3879281 -0.0001589 -0.0003503 -0.0000139 -0.5796404 0.0482426 -0.000241 0.1054525 0.1008992 -1.1782818 0.0854221 0.0070759 0.2862312 -0.4942173 0.0114791 -0.0233933 0.00934 -0.333277 -1.1781934 -0.0855415 -0.0070977 -0.2864077 -0.49432 0.0114815 0.0234019 0.0093512 -0.333296 -1.5024618 -0.0000278 0.0000769 -0.0000904 0.0509021 0.0119104 0.0000116 -0.0969118 -0.1912674 -0.0280972 0.0280715 -0.0025677 0.0916923 -0.3526231 0.026733 -0.0044207 0.0421872 0.1127456 -0.028091 -0.0280076 0.0025558 -0.0916317 -0.3526528 0.0267503 0.0044454 0.0422239 0.1127439 1.8909846 0.1403214 -0.0246985 0.2104184 0.8334698 -0.0494605 -0.0148216 -0.0357373 0.21772 1.890961 -0.1401068 0.0247276 -0.2101935 0.8333213 -0.0494919 0.0148067 -0.0357856 0.2177048 0.0451515 0.0001936 0.0488315 -0.0245034 0.0724164 0.046357 0.0714193 0.0683187 0.0020054 0.0436248 -0.0092544 -0.0499868 -0.0328934 0.0640254 -0.0523683 -0.0700031 -0.0797677 0.0088634 0.0436062 0.009266 0.0500031 0.0329112 0.0640115 -0.0523636 0.0700211 -0.0797667 0.0088852 0.0451602 -0.0002134 -0.048832 0.0244775 0.0724402 0.0463392 -0.0714289 0.0682886 0.0019887 0.343565 0.0000359 0.0002622 0.0000034 0.2828671 -0.0256088 0.0002028 -0.0171928 0.0742842 unknown
polarizability: 75.088873|0.0024934|63.7971278|-0.0014239|-2.5035838|36.2432768 unknown
InChI: InChI=1S/C4H5NO3/c6-3-1-2-4(7)5(3)8/h8H,1-2H2
charge 0 multiplicity 1
13 atoms
O  -0.00024 2.048952 0.060383
O  -2.358968 0.356789 -0.057269
O  2.358809 0.35724 -0.057229
N  -0.000095 0.634146 -0.076264
C  -0.776133 -1.589929 0.032734
C  0.776341 -1.589791 0.032806
C  -1.207668 -0.120545 -0.030393
C  1.2076 -0.120335 -0.030372
H  -1.204527 -2.040955 0.944082
H  -1.208278 -2.127895 -0.827886
H  1.208672 -2.127742 -0.827729
H  1.204722 -2.040672 0.944234
H  0.000465 2.420036 -0.865797
