program: Gaussian 09
title: 000080183
version: EM64L-G09RevD.01
frameworkgroup: C1[X(C9H18O)]
method: RPBEPBE
basis: SDD
operation: Freq
keyword: #pfreq=noraman
keyword: PBEPBE/SDD
title: #p freq=noraman PBEPBE/SDD
converged: YES YES NO NO
title: Mulliken charges:
elementType: O C C C C C C C C C H H H H H H H H H H H H H H H H H H
charge: -0.459646 0.316868 -0.447569 -0.437241 -0.731414 -0.733460 -0.319654 0.367471 -0.785068 -0.795201 0.214065 0.196939 0.213558 0.223007 0.244804 0.226007 0.198722 0.235371 0.213926 0.202354 0.211639 0.323785 0.213955 0.226854 0.214961 0.228196 0.220313 0.216458
chargesum: 0.00000
title: Mulliken charges with hydrogens summed into heavy atoms:
elementType: O C C C C C C C C C
charge: -0.135861 0.316868 -0.036565 -0.000676 -0.061882 -0.081810 -0.108015 0.367471 -0.129297 -0.130233
polarizability: 1.33280185e+02 5.11725168e+00 9.65983850e+01 3.12748492e+00 1.65852519e+00 8.29106366e+01
1716.lowfreq: -12.0248 -7.6304 -0.0001 0.0005 0.0008 7.6043 23.2048 47.4697 84.4562
frequency: 23.0519 47.3226 84.4561 116.1710 131.7630 175.3862 189.0256 207.6239 231.0233 271.4634 297.1916 316.5599 337.7767 357.0411 387.0175 403.7904 435.7144 470.6085 492.9549 558.3638 729.8748 764.3563 795.4050 838.2930 876.2634 915.8997 929.4289 947.5308 974.3421 987.8022 994.1792 1030.1521 1050.5384 1081.6420 1092.9536 1123.1775 1134.6291 1182.6149 1218.0813 1231.3684 1255.9165 1283.9645 1332.1090 1353.0819 1359.7690 1375.8640 1387.4941 1392.4305 1398.4011 1445.9498 1455.6929 1457.9740 1463.2024 1464.2567 1472.2960 1472.9330 1473.9863 1482.3630 1488.0331 1695.4879 2952.4975 2955.2875 2962.5218 2969.5976 2973.3973 2994.7471 3015.9712 3026.1035 3030.0844 3048.0231 3061.0536 3065.1922 3077.3829 3085.1855 3092.3017 3093.8303 3103.5452 3539.5870
redmass: 2.7983 3.0736 2.6960 2.4058 1.0411 1.6231 1.1347 1.6334 1.0699 2.4810 2.2080 1.2257 2.0361 2.6544 2.3215 2.2064 2.5000 2.5671 2.8809 2.7244 3.1019 1.6756 2.0198 1.5431 2.5132 1.7497 1.5499 1.3826 1.4810 1.6096 1.2517 2.0946 2.1990 1.6596 1.5050 1.3931 2.1497 1.9719 2.1405 2.0452 1.4084 1.3292 1.6374 1.4886 1.4469 1.2976 1.3057 1.2588 1.2339 1.0677 1.0507 1.0589 1.0665 1.0618 1.0707 1.0491 1.0736 1.0834 1.0540 6.4993 1.0618 1.0373 1.0386 1.0373 1.0644 1.0359 1.0943 1.0969 1.0964 1.0927 1.0967 1.0951 1.0972 1.0999 1.0957 1.0993 1.0993 1.0656
irintensity: 0.5784 0.1671 0.5828 0.6324 0.2030 4.4323 1.8958 0.0436 3.9534 2.5160 1.4756 84.5449 85.6526 2.1094 0.1962 2.4304 12.3948 4.6340 6.6758 1.5057 2.4582 10.6958 3.3375 8.4384 31.8544 7.5905 2.4154 0.8972 4.1785 0.1993 5.4419 16.0717 3.0239 3.6619 19.0335 28.1036 17.3353 37.9209 30.9848 7.2327 39.1206 9.6010 10.1099 10.8562 3.1818 34.4817 19.8986 26.8759 9.7491 0.6976 1.0892 1.2936 5.1931 5.5927 4.1549 20.3683 14.4422 16.9211 11.0212 1.7766 22.1082 45.9223 55.2998 30.4279 24.2562 14.0856 13.0700 12.1148 48.0938 3.2795 14.4272 65.6107 55.0206 7.0540 53.5417 46.8126 30.1436 5.1458
temp: 298.150 k
press: 1.00000 atm
elementType: 8 6 6 6 6 6 6 6 6 6 1 1 1 1 1 1 1 1 1 1 1 1 1 1 1 1 1 1
symmnumber: 1
zpe: 651907.1 jmol-1
zpe.correction: 0.248298 hartree
zpe.thermalcorrener: 0.261833 hartree
zpe.thermalcorrenthalpy: 0.262777 hartree
zpe.thermalcorrgfe: 0.208084 hartree
zpe.sumelectzpe: -428.128093 hartree
zpe.sumelectthermal: -428.114558 hartree
zpe.sumelectthermalent: -428.113614 hartree
zpe.sumelectthermalfe: -428.168307 hartree
dipole: 0.5544 -0.6014 1.6452
dipole: 1.8374
quadrupole: -64.1754 -59.4804 -67.9621
quadrupole: 2.8705 -3.7183 1.3678
quadrupole: -0.3027 4.3922 -4.0895 2.8705 -3.7183 1.3678
hfenergy: -428.3763912 hartree
pointgroup: C01 [X(C9H18O1)]
dipole: -0.2255179 0.0120119 0.6866889 debye
polarizability: 132.8447712|7.1109051|96.6835896|-0.9530764|2.8018601|83.2608462 unknown
InChI: InChI=1S/C9H18O/c1-8(2)6-5-7-9(3,4)10/h6,10H,5,7H2,1-4H3
charge 0 multiplicity 1
28 atoms
O  2.631234 1.016109 -0.942358
C  2.300508 0.028395 0.127301
C  0.833916 0.245662 0.596939
C  -0.231456 0.0802 -0.518935
C  2.515482 -1.336355 -0.548744
C  3.274446 0.222157 1.311977
C  -1.590492 0.595195 -0.093368
C  -2.764119 -0.093738 0.013478
C  -4.041054 0.606993 0.45383
C  -2.9311 -1.572911 -0.289696
H  0.609586 -0.450557 1.429266
H  0.754861 1.270025 1.021285
H  -0.288532 -0.979403 -0.824965
H  0.123326 0.646999 -1.404572
H  1.920226 -1.406917 -1.473885
H  3.578405 -1.459399 -0.81932
H  2.223087 -2.158794 0.128579
H  4.318585 0.165104 0.957079
H  3.124623 -0.554529 2.084427
H  3.123949 1.208131 1.794419
H  -1.613118 1.668073 0.161353
H  2.57191 1.925808 -0.550288
H  -4.458437 0.140123 1.368717
H  -3.870292 1.677642 0.662224
H  -4.826011 0.530297 -0.325409
H  -1.98539 -2.068844 -0.561783
H  -3.644333 -1.722674 -1.125055
H  -3.35551 -2.103991 0.585703
