program: Gaussian 09
title: 000080192
version: EM64L-G09RevD.01
frameworkgroup: C1[X(C20H17N3O2)]
method: RPBEPBE
basis: SDD
operation: Freq
keyword: #p
keyword: freq=noraman
keyword: PBEPBE/SDD
title: #p freq=noraman PBEPBE/SDD
converged: YES YES NO NO
title: Mulliken charges:
elementType: O O N N N C C C C C C C C C C C C C C C C C C C C H H H H H H H H H H H H H H H H H
charge: -0.280073 -0.213552 -0.089595 -0.111353 -0.130593 0.446202 -0.319448 -0.364531 0.155513 -0.282283 -0.357369 -0.641325 0.227331 0.182189 -0.339304 -0.329603 -0.215471 -0.217281 0.179117 -0.218285 -0.345023 -0.300451 -0.205037 -0.202137 -0.240614 0.250093 0.237057 0.275329 0.249419 0.268249 0.243982 0.231245 0.270914 0.272951 0.237497 0.235976 0.236388 0.248453 0.272897 0.228393 0.225815 0.228316
chargesum: 0.00000
title: Mulliken charges with hydrogens summed into heavy atoms:
elementType: O O N N N C C C C C C C C C C C C C C C C C C C C
charge: -0.280073 -0.213552 -0.089595 -0.111353 -0.130593 0.446202 -0.069355 -0.127474 0.155513 -0.006954 -0.107949 0.102151 0.227331 0.182189 -0.068389 -0.056652 0.022025 0.018695 0.179117 0.018103 -0.096570 -0.027554 0.023356 0.023678 -0.012298
polarizability: 5.78599604e+02 4.01669788e+01 2.72770685e+02 1.47223715e+01 -1.58355384e+00 1.33325018e+02
1716.lowfreq: -5.0138 -0.0007 -0.0003 0.0005 2.2193 7.4999 18.0820 18.8949 24.1139
frequency: 17.5918 18.8089 23.9854 41.1721 45.5518 56.3810 70.0969 92.9747 109.7358 151.6117 163.6657 176.7129 179.7279 207.2730 234.5381 253.3230 272.8279 311.7296 319.9635 380.1513 390.0304 401.1027 407.3883 421.1990 423.5406 437.8011 484.8821 501.5349 517.8606 527.5901 549.2596 608.2075 613.6882 615.9978 629.4984 667.7692 671.0405 692.7381 697.3907 725.2652 734.1027 781.1220 789.8499 794.1679 812.2248 815.6512 844.4928 852.3911 863.7931 870.0370 898.0209 938.7606 953.8977 960.4017 966.5091 985.1597 985.5880 989.1507 990.1067 991.6278 995.6208 999.4138 1009.8761 1014.2144 1028.8824 1063.9943 1074.0389 1086.0692 1100.8277 1113.9371 1139.5907 1152.7193 1161.0094 1168.9272 1175.9268 1183.8372 1190.1850 1224.0427 1243.8860 1297.1923 1304.3090 1316.7876 1325.3380 1344.3450 1373.7505 1389.0113 1390.2091 1429.9933 1439.5266 1440.9688 1445.8906 1463.1776 1466.8886 1476.8720 1478.1403 1491.1357 1557.7261 1581.8291 1586.4641 1601.5978 1610.5427 1613.9556 1655.6786 2963.5640 3078.8952 3125.6429 3126.3431 3134.0341 3136.6450 3145.8882 3150.1249 3151.3014 3157.3604 3158.8761 3164.0343 3168.8334 3170.6597 3173.7673 3179.3479 3181.6233
redmass: 4.0889 4.9150 5.3250 5.0588 3.9885 6.1591 6.6783 4.2616 4.9349 6.1021 4.1003 2.0963 5.3415 4.5025 3.0257 2.7519 5.5985 5.6663 6.6450 4.2082 4.5571 2.8142 2.9113 5.4614 3.7329 3.9179 4.7577 3.6919 6.2044 4.9681 2.8175 6.6094 6.5241 6.6493 7.2586 6.5543 5.2079 1.8858 1.6892 5.9309 3.7871 1.7854 2.4597 5.4829 2.0165 2.3358 1.7138 1.2480 1.2589 3.7368 7.2477 1.4423 1.4200 1.3687 7.8133 6.0399 1.3751 1.7457 4.0607 2.1777 1.3917 1.3216 1.3327 2.0686 2.0844 4.1493 1.4934 1.5576 1.5937 1.3500 1.9928 1.3752 1.3604 1.0607 1.0580 1.1577 1.5787 3.5311 2.9211 1.3508 1.4333 1.3246 3.5458 6.8853 5.4318 8.9959 9.9547 1.1685 2.2627 2.7993 3.3901 1.9239 1.2154 1.2338 1.7753 2.4815 7.0390 6.2146 6.3404 6.2857 6.0479 6.5351 11.9836 1.0434 1.0920 1.0850 1.0992 1.0857 1.0887 1.0890 1.0880 1.0930 1.0938 1.0879 1.0959 1.0978 1.0995 1.0954 1.0987 1.0961
irintensity: 0.5635 1.5291 0.0751 1.1006 2.3951 3.4879 3.6334 0.2506 3.2458 0.3512 3.2225 0.9371 3.3358 15.1112 33.7209 0.9480 1.0978 10.0769 19.2105 10.4049 36.7405 0.1367 0.8193 4.8529 11.2190 7.9898 0.2942 22.9443 10.5318 26.9354 35.6625 0.6270 0.7911 4.6053 1.0212 13.9465 31.2099 50.2914 74.0638 62.7822 15.5590 36.8768 24.0942 9.5851 16.5622 5.2096 57.9568 0.1892 0.3211 9.6233 0.1988 7.6352 10.4585 5.9103 571.1902 0.1288 0.0375 2.8475 0.3080 2.2655 0.1013 0.9421 0.1732 10.4621 12.9645 14.7398 11.0653 12.4021 158.4844 21.2767 12.0214 11.1159 146.4754 0.1270 0.4168 52.1182 6.7716 251.8135 18.0317 15.6839 12.6937 5.9599 172.8672 108.1082 1.8682 1.7625 2.1886 7.1688 19.5981 12.0532 3.2281 6.0197 2.7116 44.9126 43.7980 100.4621 25.5419 2.6531 10.1937 1.3820 29.2242 323.8919 203.1869 85.4609 14.6838 4.3896 12.0079 0.1980 11.7702 7.7816 6.1949 26.4978 13.0194 0.2066 21.2612 26.7784 40.0155 16.6834 8.5817 10.5909
temp: 298.150 k
press: 1.00000 atm
elementType: 8 8 7 7 7 6 6 6 6 6 6 6 6 6 6 6 6 6 6 6 6 6 6 6 6 1 1 1 1 1 1 1 1 1 1 1 1 1 1 1 1 1
symmnumber: 1
zpe: 846381.5 jmol-1
zpe.correction: 0.322370 hartree
zpe.thermalcorrener: 0.344079 hartree
zpe.thermalcorrenthalpy: 0.345024 hartree
zpe.thermalcorrgfe: 0.267778 hartree
zpe.sumelectzpe: -1085.206650 hartree
zpe.sumelectthermal: -1085.184940 hartree
zpe.sumelectthermalent: -1085.183996 hartree
zpe.sumelectthermalfe: -1085.261241 hartree
dipole: 2.8780 -0.8371 -2.1430
dipole: 3.6845
quadrupole: -117.4744 -122.5236 -150.8297
quadrupole: -9.0088 -5.2375 -5.2938
quadrupole: 12.8015 7.7523 -20.5538 -9.0088 -5.2375 -5.2938
hfenergy: -1085.5290198 hartree
pointgroup: C01 [X(C20H17N3O2)]
dipole: -1.167613 -0.0691522 0.8563028 debye
polarizability: 574.4663125|-40.2507438|265.4145584|40.6280508|-36.421273|144.8144368 unknown
InChI: InChI=1S/C20H17N3O2/c1-23(25-20(24)16-8-4-2-5-9-16)19-14-12-18(13-15-19)22-21-17-10-6-3-7-11-17/h2-15H,1H3
charge 0 multiplicity 1
42 atoms
O  -3.032183 0.990308 -0.038272
O  -4.388667 1.150461 -1.96317
N  -2.133019 1.981161 -0.677542
N  3.364617 0.738794 0.007115
N  3.712256 -0.523833 0.107054
C  -0.782808 1.648769 -0.436076
C  -0.381994 0.278763 -0.332966
C  0.21274 2.66925 -0.377659
C  1.966782 0.961546 -0.136407
C  0.966624 -0.056604 -0.18233
C  1.565732 2.319643 -0.238645
C  -2.648815 3.349513 -0.511246
C  -4.935662 -0.453551 -0.195548
C  -4.143276 0.615185 -0.864963
C  -6.085743 -0.93689 -0.874936
C  -4.578098 -0.993337 1.06923
C  -6.870727 -1.953231 -0.2948
C  -5.369444 -2.009405 1.644168
C  5.122299 -0.739876 0.246635
C  -6.514529 -2.490744 0.965543
C  5.517513 -2.100597 0.346163
C  6.108062 0.288393 0.288157
C  6.880771 -2.435992 0.484202
C  7.465781 -0.054855 0.426639
C  7.859219 -1.41473 0.524781
H  -1.144499 -0.502982 -0.372143
H  -0.063327 3.725076 -0.439842
H  1.282176 -1.101332 -0.103526
H  2.341754 3.090986 -0.195188
H  -3.708241 3.360719 -0.805259
H  -2.107983 4.007637 -1.211325
H  -2.535313 3.730964 0.52388
H  -6.341175 -0.506923 -1.849057
H  -3.693205 -0.615555 1.588557
H  -7.756105 -2.326253 -0.820274
H  -5.095231 -2.426363 2.618987
H  -7.125615 -3.280676 1.41615
H  4.738044 -2.869092 0.311108
H  5.782777 1.330247 0.209708
H  7.18044 -3.487047 0.559595
H  8.226542 0.733647 0.458715
H  8.918933 -1.672398 0.631888
