program: Gaussian 09
title: 000080165
version: EM64L-G09RevD.01
frameworkgroup: C1[X(C12H24O)]
method: RPBEPBE
basis: SDD
operation: Freq
keyword: #pfreq=noraman
keyword: PBEPBE/SDD
title: #p freq=noraman PBEPBE/SDD
converged: YES YES NO NO
title: Mulliken charges:
elementType: O C C C C C C C C C C C C H H H H H H H H H H H H H H H H H H H H H H H H
charge: -0.205774 -0.376163 -0.357885 -0.520807 -0.353042 -0.367662 -0.517589 -0.338972 0.196792 -0.356001 -0.356906 -0.695834 -0.696057 0.215456 0.216134 0.183548 0.183609 0.231547 0.231517 0.190024 0.190070 0.213453 0.213176 0.230451 0.230587 0.181920 0.181941 0.193597 0.193593 0.197441 0.197470 0.210459 0.214904 0.210482 0.208699 0.208696 0.217126
chargesum: 0.00000
title: Mulliken charges with hydrogens summed into heavy atoms:
elementType: O C C C C C C C C C C C C
charge: -0.205774 0.055427 0.009271 -0.057743 0.027052 0.058967 -0.056551 0.024889 0.196792 0.031190 0.038005 -0.059990 -0.061536
polarizability: 1.74743361e+02 -1.01177234e+00 1.20596077e+02 1.05899191e-02 2.12552355e-03 1.05270350e+02
1716.lowfreq: -4.7511 -0.0010 0.0009 0.0012 9.0517 21.1367 33.8291 35.4639 35.9559
frequency: 26.8897 35.4564 35.9447 53.3895 56.4943 80.2659 89.0776 105.7550 118.9458 129.5155 142.9964 167.7177 183.6841 224.1562 224.4091 235.7218 297.1335 367.7190 402.7579 437.1155 449.4350 487.6200 662.3494 694.6900 722.8476 728.9316 744.9200 778.7283 825.4053 850.3373 874.5505 887.9099 902.2545 941.0354 973.1375 978.8067 1012.3173 1029.3256 1039.1669 1061.6845 1071.0400 1074.7117 1083.1211 1087.3275 1122.6506 1129.0782 1137.7151 1188.9801 1200.8530 1230.0666 1238.7806 1243.1089 1258.4371 1279.1709 1282.0000 1286.5683 1290.1153 1293.8077 1297.9395 1304.6159 1330.3504 1349.3709 1355.6958 1358.6365 1359.8685 1388.5383 1388.7555 1424.5918 1435.4701 1463.3957 1464.3560 1466.1786 1469.8778 1473.4119 1475.9293 1476.1860 1479.1200 1481.9082 1488.8035 1489.6809 1629.1225 2948.0814 2949.9933 2951.1926 2957.9422 2958.4876 2968.5899 2970.7258 2972.0588 2972.5645 2987.8918 2989.9214 2992.4956 2993.8808 2994.6118 3001.3283 3004.9211 3023.9845 3031.0187 3055.8582 3057.4786 3068.7092 3069.3056 3071.2602 3071.6775
redmass: 3.6852 2.3847 2.0958 2.7786 2.9304 1.8628 3.6434 1.8323 1.8441 2.2254 1.9633 3.5474 4.1320 1.1295 1.1326 4.3330 3.7417 3.2192 3.3905 3.0825 1.9662 3.2330 4.7227 1.1553 1.0760 1.0862 1.1423 1.2046 1.2484 4.2094 1.2786 1.9301 1.9729 1.2291 3.9288 1.2099 3.7976 3.5316 1.0742 2.9541 2.1994 2.2240 2.2044 1.9381 2.7419 2.7193 1.7887 1.7019 1.5364 1.3143 1.3222 1.3690 1.2499 1.1069 1.3669 1.0451 1.1073 1.1072 1.1009 1.4628 1.5131 1.5801 1.6397 1.6839 1.7575 1.2179 1.2172 1.0759 1.1088 1.0702 1.0706 1.0730 1.0703 1.0698 1.0424 1.0425 1.0683 1.0781 1.0896 1.0919 7.9754 1.0597 1.0590 1.0588 1.0589 1.0602 1.0593 1.0541 1.0413 1.0363 1.0972 1.0967 1.0989 1.0601 1.0602 1.0971 1.1014 1.1028 1.1042 1.1032 1.1033 1.1009 1.1007 1.0993 1.0992
irintensity: 0.0310 0.0442 0.0344 2.4985 0.0068 0.0797 1.3258 0.2827 0.0584 0.0480 0.1018 0.8604 0.1001 0.0056 0.0011 7.1642 0.8874 1.6737 7.9647 0.2183 0.7877 0.1250 4.1567 0.0082 24.8263 0.0150 0.6571 1.0308 5.6703 1.0724 0.8237 4.2390 1.9654 0.3793 33.1296 1.0744 0.0001 3.4117 0.2667 0.7001 0.0288 0.1681 0.1325 1.9923 0.4096 45.9192 0.0065 0.2473 0.2008 10.3292 0.0825 38.4754 0.1212 0.2616 12.2000 0.2929 0.0666 0.0017 0.4214 27.3812 17.7153 7.6471 10.5693 5.7790 20.8762 10.6395 10.5330 4.1072 35.1272 0.2164 0.7218 0.7696 1.0436 3.3112 12.2886 12.6911 4.4269 2.1744 18.0684 25.3771 83.7135 14.0263 16.6163 9.9148 1.4823 29.6852 89.1356 65.7356 26.0246 33.0686 2.8945 2.0139 5.3931 0.8763 68.5301 13.6271 0.0691 13.1996 37.2396 5.2159 89.1882 97.0189 122.8594 56.0842 51.7849
temp: 298.150 k
press: 1.00000 atm
elementType: 8 6 6 6 6 6 6 6 6 6 6 6 6 1 1 1 1 1 1 1 1 1 1 1 1 1 1 1 1 1 1 1 1 1 1 1 1
symmnumber: 1
zpe: 876108.6 jmol-1
zpe.correction: 0.333692 hartree
zpe.thermalcorrener: 0.351350 hartree
zpe.thermalcorrenthalpy: 0.352294 hartree
zpe.thermalcorrgfe: 0.285477 hartree
zpe.sumelectzpe: -545.814645 hartree
zpe.sumelectthermal: -545.796988 hartree
zpe.sumelectthermalent: -545.796043 hartree
zpe.sumelectthermalfe: -545.862860 hartree
dipole: 0.0294 -2.8688 0.0056
dipole: 2.8690
quadrupole: -82.2328 -89.0120 -81.4276
quadrupole: -1.0356 0.0106 0.0130
quadrupole: 1.9914 -4.7879 2.7965 -1.0356 0.0106 0.0130
hfenergy: -546.1483373 hartree
pointgroup: C01 [X(C12H24O1)]
dipole: -0.0079011 -1.1286787 -0.0090917 debye
polarizability: 174.736154|1.1881228|120.6026964|-0.0570606|0.0902488|105.2709381 unknown
InChI: InChI=1S/C12H24O/c1-3-5-7-9-11-12(13)10-8-6-4-2/h3-11H2,1-2H3
charge 0 multiplicity 1
37 atoms
O  -0.581186 1.531656 0.007056
C  1.987751 0.291641 -0.012064
C  3.26534 -0.57665 -0.013213
C  0.699029 -0.551021 -0.009701
C  4.563947 0.261317 -0.015053
C  -3.176513 0.347785 -0.004754
C  -1.906388 -0.522757 -0.011742
C  -4.472636 -0.492424 -0.00726
C  -0.594891 0.2715 -0.004108
C  5.848196 -0.599087 -0.016711
C  -5.752914 0.37424 -0.002496
C  7.139515 0.247599 -0.017634
C  -7.048662 -0.46525 -0.003999
H  1.984642 0.959616 -0.8948
H  1.986712 0.960833 0.869659
H  3.263251 -1.242905 0.875552
H  3.261254 -1.243873 -0.901239
H  0.679695 -1.227857 0.871522
H  0.674477 -1.22679 -0.891424
H  4.569161 0.927915 -0.902639
H  4.57148 0.928006 0.872443
H  -3.158315 1.011347 0.881108
H  -3.161413 1.021006 -0.883401
H  -1.899458 -1.206918 0.863918
H  -1.898673 -1.191844 -0.898908
H  -4.48621 -1.155405 -0.898358
H  -4.484646 -1.162745 0.878346
H  5.841531 -1.265134 0.87047
H  5.839749 -1.264363 -0.904455
H  -5.741779 1.043189 -0.886942
H  -5.739593 1.036669 0.886817
H  7.183743 0.900555 -0.909783
H  8.043301 -0.389272 -0.01943
H  7.18612 0.898889 0.875607
H  -7.097673 -1.120286 0.886536
H  -7.100109 -1.113385 -0.899432
H  -7.948134 0.177502 -0.000286
