program: Gaussian 09
title: 000080184
version: EM64L-G09RevD.01
frameworkgroup: C1[X(C9H7ClO4)]
method: RPBEPBE
basis: SDD
operation: Freq
keyword: #p
keyword: freq=noraman
keyword: PBEPBE/SDD
title: #p freq=noraman PBEPBE/SDD
converged: YES YES NO NO
title: Mulliken charges:
elementType: Cl O O O O C C C C C C C C C H H H H H H H
charge: -0.017682 -0.303142 -0.437870 -0.263315 -0.160194 0.297357 0.141225 -0.344940 -0.303271 -0.194676 -0.228025 0.149971 0.327584 -0.690002 0.260382 0.283216 0.240784 0.240222 0.322781 0.288884 0.390710
chargesum: 0.00000
title: Mulliken charges with hydrogens summed into heavy atoms:
elementType: Cl O O O O C C C C C C C C C
charge: -0.017682 -0.303142 -0.047160 -0.263315 -0.160194 0.297357 0.141225 -0.084558 -0.020055 0.046108 0.012197 0.149971 0.327584 -0.078338
polarizability: 1.62035622e+02 1.13813918e+01 1.23401340e+02 -5.93015221e+00 3.03599672e+00 6.74519799e+01
1716.lowfreq: -7.3982 -6.1647 -0.0017 -0.0007 -0.0003 3.4864 29.5982 44.9276 62.8607
frequency: 29.5837 44.9217 62.8582 96.6571 102.9657 132.9390 200.6272 222.1257 243.0579 266.3962 338.5162 403.0394 421.6083 484.5972 494.2678 525.5288 558.0707 589.9117 603.6951 653.9547 687.5005 699.8542 737.1531 765.0333 785.1084 796.3295 880.1168 894.1871 914.4490 974.2617 1002.1776 1004.1956 1036.6184 1048.4120 1104.6451 1154.3058 1157.6291 1176.5560 1187.4412 1269.2409 1285.1368 1321.7055 1386.6993 1420.4125 1432.6352 1471.2513 1576.3215 1610.7028 1634.5967 1716.3654 3065.4061 3143.9459 3149.7051 3161.4598 3176.7951 3187.5020 3531.9248
redmass: 7.4246 12.1807 7.8404 3.4598 6.8218 5.9884 8.4708 6.3801 8.9117 6.8768 7.8264 10.2144 3.1026 4.1181 3.8778 4.5499 8.7010 1.2448 5.3414 5.1134 3.6911 5.5216 5.5484 3.8050 2.0385 3.1598 3.6177 1.8765 1.7738 1.3811 1.4748 4.0390 2.1850 4.0257 2.0703 1.1468 1.5675 1.1945 2.4504 1.4839 1.3851 2.6509 10.9824 1.0852 2.2783 2.6722 6.6802 7.1119 8.4107 11.6639 1.0572 1.0869 1.1068 1.0918 1.0962 1.0977 1.0642
irintensity: 0.7480 1.3547 1.7273 8.7219 1.0341 0.2924 4.1086 0.6724 1.6012 1.2858 1.2235 5.1187 12.3847 9.1300 8.3376 25.0426 2.9617 106.8854 34.4500 10.0657 61.4850 9.6680 50.1569 23.9453 15.0113 44.4122 111.2137 34.0435 10.0731 3.4673 34.3701 256.4032 3.8981 367.1990 92.3950 13.5786 86.5048 3.7950 51.4195 7.2415 21.9376 83.6420 4.5279 43.7694 11.6995 64.8627 16.9498 31.7049 358.5199 143.1699 6.4615 3.2285 1.1725 12.8260 4.4108 7.0543 57.4327
temp: 298.150 k
press: 1.00000 atm
elementType: 17 8 8 8 8 6 6 6 6 6 6 6 6 6 1 1 1 1 1 1 1
symmnumber: 1
zpe: 376961.9 jmol-1
zpe.correction: 0.143577 hartree
zpe.thermalcorrener: 0.156507 hartree
zpe.thermalcorrenthalpy: 0.157451 hartree
zpe.thermalcorrgfe: 0.102088 hartree
zpe.sumelectzpe: -1107.106712 hartree
zpe.sumelectthermal: -1107.093783 hartree
zpe.sumelectthermalent: -1107.092839 hartree
zpe.sumelectthermalfe: -1107.148202 hartree
dipole: -4.2264 -0.2736 -1.9924
dipole: 4.6805
quadrupole: -84.1106 -72.0982 -91.9751
quadrupole: 2.3056 -6.9421 1.5475
quadrupole: -1.3826 10.6297 -9.2471 2.3056 -6.9421 1.5475
hfenergy: -1107.2502896 hartree
pointgroup: C01 [X(C9H7Cl1O4)]
dipole: -1.6617489 0.0823874 0.7891207 debye
dipolederiv: -0.4702782 -0.0053779 0.061939 -0.0442784 -0.1321419 0.0070195 0.1527521 0.0071318 -0.1679916 -2.0703429 0.0959 0.2677218 0.3612585 -0.3253852 -0.1215979 0.1632031 -0.0918674 -0.5389482 -0.5730646 -0.5091556 -0.0760839 -0.4525686 -1.0970336 -0.1685097 -0.1036242 -0.2209182 -0.4622636 -1.0343455 0.100727 -0.1468323 0.1893954 -0.73244 0.03458 -0.1555633 0.0124542 -0.329798 -0.5919752 0.0377541 -0.1210109 0.0880859 -0.2826039 0.0229407 0.3759534 0.0251479 -0.8453708 1.2199889 0.0760957 0.0172849 -0.2075955 0.3744777 -0.0162477 0.3567718 0.0506771 0.0491719 -0.2992097 0.295313 0.0008278 0.15643 -0.6418797 -0.0413683 -0.0973339 -0.0082777 -0.0036064 -0.4277056 0.133572 0.0406927 0.2641807 -0.0522107 0.0642807 -0.0026154 0.0498759 -0.114294 0.0086677 -0.2089673 0.0163759 0.0435711 0.1393011 0.0523204 0.0372668 -0.0110955 -0.0734959 0.1674128 -0.0216878 0.048398 -0.0047503 0.1663692 0.0310638 0.077213 0.0395776 -0.0942126 0.0946085 -0.0139096 0.0780775 -0.0858268 -0.2980782 -0.0182228 0.0613751 -0.0223108 -0.14567 1.3506911 -0.0139779 0.2541022 -0.0361304 1.8781939 0.1530865 0.287083 0.2109244 0.3323424 1.8552184 -0.1720529 -0.1460741 -0.5307327 0.3843387 0.0762879 -0.6381445 0.0215648 1.2144784 0.4377049 0.0784804 -0.2392772 0.2251411 0.0853528 0.0630208 -0.4584573 0.0494187 0.0877496 0.0647954 -0.0703194 -0.0468011 -0.0604728 0.015973 -0.03263 -0.0356407 -0.0388529 0.1481799 0.0763175 -0.0462578 -0.0223574 -0.0543588 0.0552402 -0.0327875 -0.0314927 -0.0329122 0.1473266 0.0466025 0.0798606 -0.0069232 0.0896722 -0.0531924 -0.0171749 -0.0150217 -0.019068 0.1496053 -0.088633 0.027899 -0.0587745 0.0134259 0.0860356 -0.0092358 -0.0654364 -0.0075683 0.146219 0.031524 -0.0300422 0.0485591 -0.0187415 0.0351631 0.028983 0.074175 0.0199209 0.1038585 -0.0018303 0.0059814 0.0601855 -0.0376386 0.0757714 -0.0839659 0.0509883 -0.0620759 0.0102106 0.2038534 0.1601652 -0.0300299 0.1019335 0.318749 0.0081571 -0.0334515 0.0282537 0.3865089 unknown
polarizability: 161.4872863|-12.680413|123.1195569|5.2219424|7.2768839|68.2820981 unknown
InChI: InChI=1S/C9H7ClO4/c10-5-8(11)14-7-4-2-1-3-6(7)9(12)13/h1-4,12H,5H2
charge 0 multiplicity 1
21 atoms
Cl 4.753229 0.216581 -0.32649
O  0.933585 0.75841 0.76385
O  -1.350742 -2.745585 -0.424205
O  0.727194 -1.984121 0.245433
O  1.793718 0.393961 -1.398374
C  -0.421369 0.790793 0.337664
C  -1.123585 -0.390154 -0.042367
C  -1.068771 2.039525 0.38627
C  -2.498321 -0.268848 -0.386277
C  -2.435028 2.134177 0.047147
C  -3.150264 0.977794 -0.345027
C  -0.466974 -1.723429 -0.049327
C  1.954403 0.394972 -0.175317
C  3.177474 0.039255 0.644486
H  -0.491264 2.918774 0.68583
H  -3.037804 -1.172644 -0.68005
H  -2.935381 3.107583 0.083377
H  -4.208686 1.049539 -0.614035
H  3.085501 -1.017251 0.940712
H  3.253429 0.679477 1.533477
H  -0.856043 -3.60851 -0.419978
