program: Gaussian 09
title: 000080332
version: EM64L-G09RevD.01
frameworkgroup: C1[X(C17H14N2O9S2)]
method: RPBEPBE
basis: SDD
operation: Freq
keyword: #p
keyword: freq=noraman
keyword: PBEPBE/SDD
title: #p freq=noraman PBEPBE/SDD
converged: YES YES NO NO
title: Mulliken charges:
elementType: S S O O O O O O O O O N N C C C C C C C C C C C C C C C C C H H H H H H H H H H H H H H
charge: 0.860552 0.993083 -0.510058 -0.535493 -0.189087 -0.568548 -0.485091 -0.493136 -0.371206 -0.460904 -0.205118 -0.339938 -0.064923 -0.242274 0.532240 -0.322873 -0.091529 -0.155419 -0.050108 -0.639814 0.191044 0.293980 -0.257436 -0.245098 -0.241462 0.173194 -0.787097 -0.378151 0.173294 0.120827 0.321762 0.301743 0.277783 0.291560 0.294806 0.352777 0.307549 0.250056 0.289133 0.229680 0.238725 0.386103 0.367928 0.386947
chargesum: 0.00000
title: Mulliken charges with hydrogens summed into heavy atoms:
elementType: S S O O O O O O O O O N N C C C C C C C C C C C C C C C C C
charge: 0.860552 0.993083 -0.510058 -0.535493 -0.189087 -0.182445 -0.485091 -0.493136 -0.003278 -0.073957 -0.205118 -0.339938 -0.064923 -0.242274 0.532240 -0.001112 -0.091529 0.146324 -0.050108 -0.070470 0.191044 0.293980 0.037371 0.107678 0.066088 0.173194 -0.018228 -0.139425 0.173294 0.120827
polarizability: 3.56265787e+02 1.46609866e+00 3.13878729e+02 1.26216971e+01 -2.14068171e+01 2.18997692e+02
1716.lowfreq: -10.7239 -2.2080 0.0005 0.0011 0.0015 4.6869 18.2810 19.2064 22.8316
frequency: 18.2570 19.1715 22.8138 33.2368 41.9616 52.4737 64.5849 72.0401 81.7036 94.2571 108.6054 121.7145 132.2307 133.9816 147.8206 158.4855 166.7658 179.5514 188.6088 200.3353 213.0336 219.9150 235.5554 245.4849 268.8177 281.6813 299.4409 307.4336 315.0162 331.4847 344.5435 349.6334 361.1290 381.5995 392.2223 407.5097 417.8919 435.1341 437.8469 441.1974 448.6136 474.3375 485.4946 513.5928 535.2840 542.0386 550.0312 574.0424 586.2196 591.7030 607.9551 613.1313 623.7392 643.4834 691.5008 706.2016 729.0152 734.4184 774.0264 779.7238 785.5224 821.9900 826.5598 837.3177 843.0905 891.3602 895.7676 899.3989 926.3737 950.9479 972.3824 972.8673 974.0039 977.2211 991.0021 994.9210 1006.5265 1034.5514 1043.4986 1051.3218 1066.6179 1083.7010 1092.0889 1127.1011 1130.1398 1154.8205 1158.7966 1161.3787 1198.2483 1255.8424 1260.9790 1285.1237 1297.9937 1299.3953 1351.7744 1361.0655 1386.9233 1399.1771 1401.6266 1407.3979 1421.6145 1454.3113 1466.1480 1470.9840 1477.7547 1549.0085 1581.1007 1581.9501 1599.5410 1605.9784 1659.0188 1665.5816 2978.1057 3017.4872 3054.1578 3073.6830 3106.6489 3128.5028 3150.2285 3155.9846 3160.4692 3174.0528 3177.3177 3482.6821 3525.5114 3551.0003
redmass: 9.3817 8.5701 7.6333 7.2383 11.3057 5.2791 5.7813 8.3660 5.5130 8.0018 7.2137 7.1127 4.2913 3.6055 3.4375 1.4424 3.0494 2.7341 10.0074 5.7754 5.4698 5.2800 7.7218 6.5359 6.2539 3.9206 5.1517 7.6673 6.7525 6.8190 10.3325 5.9313 6.1446 7.1315 7.8979 7.4860 1.5509 8.9459 1.9433 2.8675 3.9950 4.4463 6.8990 4.5756 7.8724 2.9045 5.4763 5.9078 5.0536 1.4559 6.0924 6.0785 5.4073 7.1233 5.2002 7.8307 5.7859 3.7477 4.0469 7.0383 10.7886 6.8191 1.6158 6.4328 1.5322 2.1229 2.7073 1.7101 15.7537 6.2756 7.3142 1.9276 1.5506 2.5684 1.7347 2.7881 2.0422 1.5085 3.6882 1.3463 2.4863 2.0654 1.9095 1.9002 1.5436 1.6208 1.7353 1.2350 1.5430 1.3709 2.6949 1.3642 2.4603 3.6244 3.5274 4.7020 4.2405 1.1130 6.3396 1.3691 3.6028 1.1518 3.2191 1.0882 2.6836 6.3760 5.5250 6.3605 7.3988 8.2203 8.9025 12.5837 1.0378 1.0624 1.0967 1.0989 1.0994 1.0900 1.0895 1.0933 1.0954 1.0928 1.0962 1.0662 1.0641 1.0660
irintensity: 0.3645 1.2295 0.6177 2.6043 1.4530 1.2693 0.9528 0.8401 3.1524 0.4419 5.7839 5.6293 1.3018 3.4401 2.1221 0.8333 20.8543 16.1784 6.9164 9.1044 5.6484 15.8603 6.5811 14.9833 21.5808 58.4467 9.2999 6.6284 7.3346 2.2787 15.7744 15.8611 5.4808 18.8502 11.0392 18.8020 105.8665 33.8261 12.3172 5.4371 14.1643 10.5893 105.5339 79.6705 100.8953 4.3205 60.3977 29.0303 8.1603 174.1663 16.5636 37.9699 28.5262 3.6058 15.1696 17.4376 4.5113 7.1239 2.1822 22.6587 51.7842 70.1346 38.5237 83.1132 18.0520 6.2153 13.6355 9.8072 78.2068 2.5641 24.8041 104.8777 0.3586 141.1781 21.2216 8.2344 0.6079 7.5609 55.0634 34.5555 54.9888 77.3893 140.9502 15.2387 14.8412 44.9542 133.0459 10.7221 14.8696 5.6216 40.1903 83.9883 84.4171 131.4291 22.9103 41.6929 41.7219 51.7182 24.1185 22.7049 18.7123 6.0879 206.4455 23.9824 45.8943 4.6895 18.5253 18.3908 30.9742 82.1630 418.8970 176.5237 21.6523 0.2533 9.8867 0.4329 0.5941 8.8127 11.0587 92.3295 24.6299 12.1726 6.6970 48.2744 41.7461 64.4318
temp: 298.150 k
press: 1.00000 atm
elementType: 16 16 8 8 8 8 8 8 8 8 8 7 7 6 6 6 6 6 6 6 6 6 6 6 6 6 6 6 6 6 1 1 1 1 1 1 1 1 1 1 1 1 1 1
symmnumber: 1
zpe: 764266.4 jmol-1
zpe.correction: 0.291094 hartree
zpe.thermalcorrener: 0.320988 hartree
zpe.thermalcorrenthalpy: 0.321932 hartree
zpe.thermalcorrgfe: 0.228060 hartree
zpe.sumelectzpe: -2236.315122 hartree
zpe.sumelectthermal: -2236.285228 hartree
zpe.sumelectthermalent: -2236.284284 hartree
zpe.sumelectthermalfe: -2236.378155 hartree
dipole: -6.6106 -0.0712 -3.2267
dipole: 7.3564
quadrupole: -213.7516 -151.5405 -204.4256
quadrupole: 1.1922 -16.1346 -9.8983
quadrupole: -23.8457 38.3654 -14.5197 1.1922 -16.1346 -9.8983
hfenergy: -2236.6062158 hartree
pointgroup: C01 [X(C17H14N2O9S2)]
dipole: -2.6171341 -0.1136826 1.2305735 debye
polarizability: 356.5227802|2.4627279|309.0140324|-7.8255632|-30.9227006|223.6053953 unknown
InChI: InChI=1S/C17H14N2O9S2/c1-9-6-16(21)19(18-9)13-8-11(30(26,27)28)3-5-15(13)29(24,25)10-2-4-14(20)12(7-10)17(22)23/h2-5,7-8,20,22,26H,6H2,1H3
charge 0 multiplicity 1
44 atoms
S  -0.5133 0.114534 -2.034839
S  5.043712 1.820743 0.960543
O  -0.554641 -1.474615 -2.3772
O  -0.424572 1.199776 -3.262869
O  3.354547 -2.952701 -0.243279
O  4.255936 2.502351 2.499479
O  5.928695 0.527927 1.352754
O  5.682855 3.048487 0.125217
O  -5.540537 1.995769 0.821687
O  -3.421945 -1.429433 2.194485
O  -4.954331 0.191293 2.826621
N  1.315824 -1.749227 0.067478
N  -0.056349 -2.036828 0.373112
C  1.040676 0.523707 -0.95396
C  1.743521 -0.421733 -0.162445
C  2.980962 -0.011144 0.408189
C  -2.045473 0.691422 -1.0553
C  1.515283 1.828815 -1.172498
C  3.415568 1.296235 0.183217
C  1.131743 -4.070388 0.188754
C  2.122187 -2.921146 -0.024781
C  -0.172989 -3.351367 0.454283
C  2.725632 2.247309 -0.582997
C  -2.476866 0.027121 0.095531
C  -2.732966 1.783455 -1.617236
C  -3.655969 0.4721 0.751274
C  -1.48452 -4.005839 0.757233
C  -3.903887 2.222835 -0.979077
C  -4.373843 1.580001 0.197831
C  -4.105229 -0.202076 1.999227
H  3.576058 -0.711911 1.000468
H  0.959617 2.489881 -1.846137
H  1.45133 -4.725713 1.018126
H  1.08615 -4.696787 -0.721669
H  3.129209 3.251028 -0.741705
H  -1.903065 -0.809991 0.502168
H  -2.354134 2.254942 -2.529864
H  -1.842306 -4.57452 -0.122547
H  -2.245212 -3.254015 1.021755
H  -1.384354 -4.726713 1.59022
H  -4.464986 3.067962 -1.396666
H  4.98478 2.879929 3.07337
H  -5.953263 2.756836 0.338515
H  -3.732548 -1.81111 3.059332
