program: Gaussian 09
title: 000080404
version: EM64L-G09RevD.01
frameworkgroup: C1[X(C24H34O)]
method: RPBEPBE
basis: SDD
operation: Freq
keyword: #pfreq=noraman
keyword: PBEPBE/SDD
title: #p freq=noraman PBEPBE/SDD
converged: YES YES NO NO
title: Mulliken charges:
elementType: O C C C C C C C C C C C C C C C C C C C C C C C C H H H H H H H H H H H H H H H H H H H H H H H H H H H H H H H H H H
charge: -0.427963 0.070317 0.146102 0.411237 0.357356 -0.117334 0.415438 -0.631592 -0.634184 -0.698656 -0.697682 -0.752440 -0.753157 -0.732101 -0.732800 0.132461 0.297529 0.494413 -0.438457 -0.421162 -0.417175 -0.434274 -0.701971 -0.700219 -0.750169 0.265483 0.269352 0.216154 0.235247 0.204012 0.235826 0.215391 0.204120 0.219969 0.225145 0.221375 0.219562 0.217674 0.213972 0.210427 0.200652 0.262008 0.200946 0.209518 0.262788 0.232007 0.234510 0.222173 0.243346 0.215618 0.206230 0.222989 0.215159 0.206240 0.223310 0.216465 0.215990 0.216734 0.336092
chargesum: 0.00000
title: Mulliken charges with hydrogens summed into heavy atoms:
elementType: O C C C C C C C C C C C C C C C C C C C C C C C C
charge: -0.091871 0.070317 0.146102 0.411237 0.357356 -0.117334 0.415438 -0.366109 -0.364832 -0.043242 -0.042345 -0.085952 -0.101949 -0.059014 -0.059547 0.132461 0.297529 0.494413 -0.206450 -0.186652 -0.195002 -0.190928 -0.057134 -0.055510 -0.100980
polarizability: 3.91065533e+02 2.53394608e-01 2.72444086e+02 -2.90203764e-01 1.08238222e+01 1.84106790e+02
1716.lowfreq: -9.4713 -6.7356 -5.0885 -0.0011 -0.0007 -0.0005 25.2292 29.6591 44.7179
frequency: 24.9866 29.5758 44.6074 53.5747 62.3176 71.5319 84.6255 122.2496 132.1208 136.1951 153.1618 171.7537 183.0200 191.3698 200.4227 212.2386 226.5320 246.5497 249.0473 261.2626 265.0741 279.4889 286.9143 299.3362 302.1808 311.2738 321.6983 328.0759 335.6120 342.0602 344.7070 357.4316 375.8568 377.6025 391.0196 400.1754 408.2004 414.7271 431.0589 440.6829 448.6139 465.8619 514.5287 524.7203 545.9199 555.4276 616.4324 622.6725 629.4903 646.5058 666.3408 741.6868 745.5815 754.6878 781.6929 798.3960 832.9460 838.6260 842.9662 877.8206 884.9263 903.0084 912.8703 914.9563 916.6434 924.8256 927.2700 928.7875 930.3700 941.0834 946.1359 948.2888 956.4889 967.5753 1007.4633 1017.1099 1019.2155 1023.3774 1024.1668 1025.9983 1032.4387 1072.7877 1103.1291 1116.5313 1125.7968 1141.9592 1195.1329 1199.6299 1203.9326 1204.0748 1205.3973 1207.1144 1216.4716 1225.5898 1252.3857 1254.0723 1273.3983 1289.6402 1308.6164 1325.7877 1341.4657 1367.1075 1367.8629 1372.9615 1373.3359 1375.3617 1381.0779 1386.8592 1397.2846 1402.6335 1406.4796 1411.3107 1426.2131 1435.1734 1455.9361 1456.3648 1459.0653 1463.9342 1466.1606 1467.2798 1472.4524 1474.3887 1477.0470 1478.4023 1478.6430 1485.0874 1486.4364 1490.1804 1491.6676 1495.5434 1502.4296 1507.3636 1511.7901 1562.2825 1589.9703 1608.6201 1620.7122 2970.5700 2971.3929 2971.5693 2971.8689 2974.2507 2975.7902 2977.0027 2978.7112 2981.0804 3056.1866 3059.7998 3061.5152 3063.2062 3064.8231 3066.1289 3069.5748 3069.7349 3073.1851 3073.7514 3074.4737 3076.4639 3077.2975 3080.4695 3082.6337 3083.6658 3110.1141 3113.6995 3114.7698 3125.1355 3139.2514 3161.0946 3167.9890 3170.8492 3602.7462
redmass: 3.0230 3.4810 3.3692 3.7157 3.4088 2.6369 3.5836 2.5353 1.9730 1.6280 2.8062 1.5465 2.3439 1.2797 2.4272 1.1964 2.1622 1.4203 1.2714 1.9536 1.5377 2.5531 2.3209 1.0776 2.6169 2.4409 2.3458 2.4434 1.1128 3.5014 1.1133 2.2107 2.4067 3.2911 2.5195 2.2597 2.8421 3.0566 2.7800 3.2324 3.7343 3.0472 2.9286 3.2650 2.8533 2.8193 3.5463 4.5822 4.5336 4.7382 5.6228 5.2688 5.0020 3.7075 4.4424 3.3586 2.6034 1.5462 1.3257 4.3885 2.4551 1.5648 1.5933 1.6382 1.7291 1.6370 1.6966 1.6854 1.6473 1.2093 1.2013 1.2052 1.3560 1.3761 2.9481 1.4613 1.4776 1.3806 1.3915 1.3862 1.3815 3.2696 3.0010 2.1347 1.4904 1.5511 2.4892 2.8828 2.9397 1.2925 2.9131 2.7449 2.4981 2.7186 2.4614 1.9988 2.9936 1.5086 1.3133 4.1963 3.9482 1.8303 1.8238 1.1914 1.2616 1.2766 1.2097 1.1642 1.2382 1.2028 3.6680 1.2222 3.1514 2.4873 1.0487 1.0514 1.0508 1.0502 1.0620 1.0627 1.0530 1.0695 1.0497 1.0719 1.0540 1.0520 1.1420 1.0577 1.0514 1.0870 1.0617 1.1110 2.2515 6.1836 6.7821 5.4332 6.3599 1.0347 1.0352 1.0348 1.0361 1.0368 1.0356 1.0358 1.0374 1.0360 1.0986 1.0999 1.0978 1.0991 1.0999 1.0997 1.1006 1.0997 1.0985 1.0991 1.0984 1.1004 1.0995 1.0991 1.0992 1.0998 1.0978 1.0971 1.0863 1.0885 1.0956 1.0935 1.0890 1.0899 1.0650
irintensity: 0.0384 0.2714 0.0772 0.1136 0.0283 0.1987 0.0288 0.3077 1.0670 3.8791 7.3837 1.1429 0.3926 0.3276 0.5714 1.0333 4.5119 1.6610 2.8353 20.5686 0.1122 14.7656 19.6748 0.4926 0.0773 0.6325 12.8857 14.8759 1.1288 2.6153 1.3633 9.3770 3.8815 2.1292 2.1602 6.8613 0.0820 0.5191 0.9814 1.4181 3.8145 0.2485 4.9233 1.5984 1.9876 16.1306 13.7473 0.0971 0.8705 0.6056 15.2844 5.6185 1.8630 0.3845 4.6174 12.3075 7.4604 41.7746 15.8322 1.6851 16.6113 5.6785 5.9162 2.7047 1.2419 4.4780 1.0638 7.6273 2.3985 0.0787 1.3232 0.2873 0.5467 0.6323 6.5055 0.3109 4.0541 2.4170 0.2019 0.4446 0.6854 33.6072 42.9137 16.8898 5.0491 97.5987 6.2119 9.8920 10.5938 10.1653 6.9852 21.5119 2.6785 60.9440 42.4639 36.6739 53.2366 25.5707 4.8867 5.6167 3.8362 9.2248 23.2543 17.6225 23.1349 26.8328 18.1983 18.8747 34.5441 13.2327 4.9273 32.3490 17.3105 146.3876 0.0427 0.2257 0.0589 0.5765 2.0501 0.5481 2.5078 2.1668 0.5148 15.5085 1.8970 11.2338 1.7941 7.4851 11.8341 14.1863 22.8619 11.0135 47.2105 1.9634 1.2757 0.5049 0.5149 33.2372 20.7718 32.1654 27.0122 45.4232 45.5630 43.1632 65.5847 16.5633 7.8722 9.7884 63.7556 16.3160 6.4552 4.3817 8.5166 50.5052 133.9123 36.6390 122.6556 2.2013 39.3749 45.5769 82.3752 42.3290 1.9733 19.2924 21.5392 18.8355 23.3705 11.5137 7.2325 7.1913 76.6135
temp: 298.150 k
press: 1.00000 atm
elementType: 8 6 6 6 6 6 6 6 6 6 6 6 6 6 6 6 6 6 6 6 6 6 6 6 6 1 1 1 1 1 1 1 1 1 1 1 1 1 1 1 1 1 1 1 1 1 1 1 1 1 1 1 1 1 1 1 1 1 1
symmnumber: 1
zpe: 1345519.9 jmol-1
zpe.correction: 0.512481 hartree
zpe.thermalcorrener: 0.540111 hartree
zpe.thermalcorrenthalpy: 0.541055 hartree
zpe.thermalcorrgfe: 0.456431 hartree
zpe.sumelectzpe: -1008.286619 hartree
zpe.sumelectthermal: -1008.258989 hartree
zpe.sumelectthermalent: -1008.258045 hartree
zpe.sumelectthermalfe: -1008.342670 hartree
dipole: 0.0666 2.1528 -0.0766
dipole: 2.1552
quadrupole: -142.4643 -143.7203 -157.6817
quadrupole: 9.5422 -0.2333 2.8475
quadrupole: 5.4911 4.2351 -9.7263 9.5422 -0.2333 2.8475
hfenergy: -1008.7991003 hartree
pointgroup: C01 [X(C24H34O1)]
dipole: 0.0293613 -0.8471289 0.0211982 debye
polarizability: 390.9664138|0.0026757|272.188914|4.5323263|11.8201589|184.4610812 unknown
InChI: InChI=1S/C24H34O/c1-22(2,3)18-12-10-16(11-13-18)17-14-19(23(4,5)6)21(25)20(15-17)24(7,8)9/h10-15,25H,1-9H3
charge 0 multiplicity 1
59 atoms
O  4.4612 0.092223 0.111882
C  3.109757 -2.587614 0.151715
C  3.124741 2.636189 0.007199
C  2.356791 -1.22597 0.094044
C  2.363217 1.284293 0.034951
C  3.046348 0.028826 0.080113
C  0.217697 0.02958 0.020376
C  0.943677 -1.184291 0.063639
C  0.951345 1.24216 0.00613
C  4.007915 -2.781464 -1.114471
C  3.949131 -2.708356 1.466294
C  2.12511 -3.790912 0.162514
C  2.153712 3.8474 -0.04764
C  4.036769 2.713305 -1.255935
C  3.987741 2.790231 1.297462
C  -5.713985 -0.010715 -0.101058
C  -1.272472 0.030646 -0.0068
C  -4.168109 0.027392 -0.052477
C  -2.003478 -0.995573 -0.668441
C  -2.02632 1.052744 0.627565
C  -3.410805 -0.995552 -0.68776
C  -3.438023 1.051124 0.603294
C  -6.22008 -1.333258 0.551081
C  -6.18443 0.040543 -1.5866
C  -6.35879 1.179822 0.654206
H  0.382583 -2.12066 0.106238
H  0.397374 2.181579 -0.059785
H  4.520729 -3.760065 -1.066183
H  3.383108 -2.762395 -2.025462
H  4.787472 -2.009059 -1.25351
H  3.282374 -2.642962 2.34467
H  4.465864 -3.685734 1.495212
H  4.718338 -1.924669 1.597372
H  2.703185 -4.732525 0.199863
H  1.460804 -3.771135 1.045052
H  1.499287 -3.817619 -0.747749
H  2.746802 4.780114 -0.062584
H  1.526611 3.836649 -0.958489
H  1.490765 3.887973 0.83677
H  3.430635 2.641212 -2.178346
H  4.571655 3.682191 -1.271529
H  4.781129 1.902352 -1.259919
H  4.520677 3.760028 1.275983
H  3.347614 2.770506 2.199316
H  4.731998 1.98318 1.377689
H  -1.460734 -1.785918 -1.200241
H  -1.503528 1.845824 1.174869
H  -3.927807 -1.803256 -1.219434
H  -3.968938 1.858745 1.116134
H  -5.820891 -2.22273 0.031469
H  -7.324767 -1.382673 0.508628
H  -5.909756 -1.392653 1.610358
H  -5.784014 -0.807736 -2.17029
H  -7.288952 -0.000693 -1.640613
H  -5.84689 0.974147 -2.072697
H  -6.085498 1.180751 1.725723
H  -7.460138 1.106982 0.589358
H  -6.061522 2.151318 0.217732
H  4.844172 -0.81634 0.13571
