program: Gaussian 09
title: 000080148
version: EM64L-G09RevD.01
frameworkgroup: C1[X(C16H24O)]
method: RPBEPBE
basis: SDD
operation: Freq
keyword: #pfreq=noraman
keyword: PBEPBE/SDD
title: #p freq=noraman PBEPBE/SDD
converged: NO YES NO NO
title: Mulliken charges:
elementType: O C C C C C C C C C C C C C C C C H H H H H H H H H H H H H H H H H H H H H H H H
charge: -0.218969 -0.384074 -0.381217 -0.370629 -0.373095 -0.387992 -0.353219 -0.530943 -0.356981 0.115197 -0.696761 0.284368 -0.344021 -0.349264 -0.249379 -0.230954 -0.225043 0.195572 0.195493 0.190673 0.190617 0.187437 0.187164 0.190221 0.190237 0.218303 0.217611 0.187255 0.187251 0.235283 0.234606 0.195169 0.195183 0.215225 0.209438 0.209421 0.246998 0.277973 0.229887 0.232949 0.233011
chargesum: 0.00000
title: Mulliken charges with hydrogens summed into heavy atoms:
elementType: O C C C C C C C C C C C C C C C C
charge: -0.218969 0.006992 0.000073 0.003973 0.007363 0.047922 0.021287 -0.061055 0.033371 0.115197 -0.062678 0.284368 -0.097024 -0.071291 -0.019492 0.001996 0.007968
polarizability: 2.48953213e+02 9.12494689e+00 1.68868413e+02 6.46452886e-02 -1.12234979e-01 1.09272580e+02
1716.lowfreq: -0.0009 -0.0006 0.0011 2.0802 4.2569 8.1620 20.8483 28.8792 41.4614
frequency: 20.7092 28.8726 41.4011 46.0052 70.4911 80.6927 81.6421 110.3519 121.3098 141.8377 145.1952 154.8563 164.5524 169.4415 228.7564 238.2423 309.9997 325.1122 385.5858 400.5954 415.3885 441.5241 470.3490 503.2263 566.7733 613.4642 647.8295 697.4481 720.5503 723.1390 734.0310 757.8617 778.6666 779.0973 825.5791 859.7210 884.3241 887.6962 940.0460 956.1863 965.8507 989.8589 990.8962 991.5681 1010.2644 1014.8107 1015.4549 1027.5012 1041.3965 1067.4839 1074.7829 1080.3208 1083.6637 1090.5993 1096.8363 1122.5168 1172.6088 1184.3576 1187.2246 1197.2732 1213.5228 1222.7584 1247.9888 1255.6915 1276.0451 1281.6066 1286.9928 1288.1346 1298.1345 1298.6299 1312.1086 1320.9713 1342.4146 1354.3837 1357.5162 1361.1777 1387.5934 1390.0984 1432.9204 1436.5355 1460.8508 1462.1514 1464.6034 1467.3045 1473.3060 1477.2092 1478.6208 1479.8664 1485.6462 1489.5094 1571.8633 1599.6480 1613.2759 2948.0323 2950.8070 2951.6330 2956.4936 2957.9161 2963.4027 2969.2819 2972.2304 2983.8134 2988.1934 2995.8458 2996.1213 3002.7821 3011.3830 3026.8284 3039.9933 3059.3548 3068.8617 3070.7232 3128.0046 3138.2424 3149.6134 3158.6548 3169.0626
redmass: 3.9638 4.3070 4.5058 1.7053 3.7028 3.4704 1.7030 2.7353 1.7470 4.6406 2.6511 1.9277 2.7997 4.1613 1.1309 3.8391 4.4001 4.0856 3.9476 2.8126 3.2089 4.0169 3.3669 3.6040 2.2477 6.4265 6.3934 1.8329 1.0750 1.0761 1.1362 1.3423 2.5509 1.9187 1.3264 1.2486 1.3151 1.9039 1.3235 1.3253 5.3460 6.0246 4.8151 1.3755 1.2833 1.1980 3.6130 2.0686 3.1641 2.8579 2.3314 2.0848 1.7857 2.0965 1.3861 2.8329 1.0722 1.8144 1.1380 1.5664 1.4853 1.5764 1.3191 1.4687 1.1598 1.0643 1.4704 1.0614 1.0930 1.1319 1.4092 1.4080 1.5351 1.6676 1.6477 1.6875 9.5435 1.2182 1.2132 1.9103 1.0740 1.0722 1.0669 1.0792 1.0825 1.0422 1.9002 1.1649 1.0913 1.0953 6.8228 6.8011 6.6930 1.0589 1.0587 1.0590 1.0594 1.0598 1.0590 1.0584 1.0368 1.0964 1.0982 1.0604 1.1004 1.0974 1.1035 1.1047 1.1046 1.1033 1.1007 1.0993 1.0850 1.0880 1.0923 1.0960 1.1013
irintensity: 0.0061 0.3731 0.9819 0.2005 1.6912 0.2469 0.1003 1.0551 0.0055 0.8648 0.0199 0.0038 0.5630 0.3300 0.0021 4.1585 2.7347 4.6347 0.7028 0.0300 1.0844 0.2667 2.4378 4.0959 5.4888 0.1960 10.2812 45.9450 28.1071 0.9985 16.1854 25.3369 8.5641 12.9338 0.0477 0.6005 0.0222 6.5214 3.1339 0.0092 45.8696 2.2668 0.3122 0.5337 0.1253 0.4524 11.8137 0.4602 2.8881 3.3579 0.3184 0.1384 6.6340 3.8177 0.1517 6.6228 4.2169 0.2924 29.1272 15.4770 0.0021 78.5740 0.0196 47.7454 0.0937 0.0113 45.1305 0.4223 0.0580 0.0027 8.5062 27.2616 18.8994 9.1096 5.4310 6.3923 2.4808 11.3471 8.6408 26.4553 0.4477 0.1843 0.3569 0.5170 2.9456 12.3216 0.3770 2.3738 2.4929 30.2207 84.6786 41.2212 13.4710 5.2934 0.5733 2.1569 1.5891 25.9899 50.4270 159.3591 35.5839 1.1863 1.9611 29.9152 2.2757 6.3202 1.4239 0.0712 131.6496 89.6060 101.2387 55.6398 0.1406 6.5639 17.7003 23.8275 21.9530
temp: 298.150 k
press: 1.00000 atm
elementType: 8 6 6 6 6 6 6 6 6 6 6 6 6 6 6 6 6 1 1 1 1 1 1 1 1 1 1 1 1 1 1 1 1 1 1 1 1 1 1 1 1
symmnumber: 1
zpe: 941581.7 jmol-1
zpe.correction: 0.358630 hartree
zpe.thermalcorrener: 0.377686 hartree
zpe.thermalcorrenthalpy: 0.378630 hartree
zpe.thermalcorrgfe: 0.308295 hartree
zpe.sumelectzpe: -698.014446 hartree
zpe.sumelectthermal: -697.995389 hartree
zpe.sumelectthermalent: -697.994445 hartree
zpe.sumelectthermalfe: -698.064780 hartree
dipole: 0.8259 3.0444 0.0026
dipole: 3.1544
quadrupole: -90.7272 -107.5475 -106.7351
quadrupole: 9.3828 0.0289 -0.0718
quadrupole: 10.9427 -5.8776 -5.0652 9.3828 0.0289 -0.0718
hfenergy: -698.3730753 hartree
pointgroup: C01 [X(C16H24O1)]
dipole: -0.3271369 1.1968058 0.028921 debye
polarizability: 248.9866685|-8.9726111|168.792435|-0.2800809|1.5955349|109.3151023 unknown
InChI: InChI=1S/C16H24O/c1-2-3-4-5-6-7-11-14-16(17)15-12-9-8-10-13-15/h8-10,12-13H,2-7,11,14H2,1H3
charge 0 multiplicity 1
41 atoms
O  -2.377302 -2.036032 -0.050191
C  2.660624 -0.52021 -0.011878
C  3.90382 0.39727 -0.001583
C  1.325281 0.257596 -0.002754
C  5.238962 -0.381139 -0.009294
C  0.089465 -0.668508 -0.01566
C  6.48301 0.535605 -0.000641
C  -1.234548 0.117299 -0.000339
C  7.818237 -0.243522 -0.007585
C  -2.48028 -0.774311 -0.019488
C  9.05547 0.680264 -0.000263
C  -3.839583 -0.123142 -0.002806
C  -4.012846 1.286839 0.038005
C  -4.989322 -0.958981 -0.0281
C  -5.308144 1.847245 0.053659
C  -6.282085 -0.399782 -0.012956
C  -6.445156 1.006374 0.028238
H  2.695586 -1.175694 -0.906942
H  2.695705 -1.195893 0.868017
H  3.86898 1.072314 -0.882478
H  3.868407 1.053416 0.893486
H  1.292466 0.934662 -0.882633
H  1.291619 0.91187 0.894204
H  5.274572 -1.05534 0.872068
H  5.274377 -1.038258 -0.903466
H  0.11546 -1.322103 -0.908399
H  0.118419 -1.350733 0.85531
H  6.449013 1.19324 0.89337
H  6.449324 1.209512 -0.882438
H  -1.2802 0.806188 -0.870023
H  -1.280913 0.769555 0.897192
H  7.850686 -0.901102 -0.900329
H  7.851306 -0.915975 0.873985
H  9.996486 0.099848 -0.005185
H  9.060931 1.341234 -0.88764
H  9.061285 1.326598 0.897846
H  -3.142685 1.951024 0.058085
H  -4.835447 -2.042876 -0.059045
H  -5.432833 2.935173 0.085585
H  -7.161566 -1.052642 -0.032814
H  -7.450181 1.442919 0.040376
